Benzene, 1,1'-(1,2-dimethyl-1,2-ethanediyl)bis-, (R*,R*)-(.+/-.)-
- Formula: C16H18
- Molecular weight: 210.3141
- IUPAC Standard InChIKey: NGCFVIRRWORSML-ZIAGYGMSSA-N
- CAS Registry Number: 2726-21-8
- Chemical structure:
View 3d structure (requires JavaScript / HTML 5) - Stereoisomers:
- Other names: Bibenzyl, α,α'-dimethyl-, DL-; Bibenzyl, α,α'-dimethyl-, (.+/-.)-; Benzene, 1,1'-(1,2-dimethyl-1,2-ethanediyl)bis-, (R*,R*)-(±)-; Bibenzyl, α,α'-dimethyl-, (±)-; DL-2,3-Diphenylbutane

Condensed phase thermochemistry data

Data compiled by: Hussein Y. Afeefy, Joel F. Liebman, and Stephen E. Stein
Quantity | Value | Units | Method | Reference | Comment |
---|---|---|---|---|---|
ΔcH°solid | -8933. | kJ/mol | Ccb | Serijan and Wise, 1952 | Corresponding ΔfHºsolid = 63. kJ/mol (simple calculation by NIST; no Washburn corrections) |

Phase change data

Data compiled by: Thermodynamics Research Center, NIST Boulder Laboratories, Chris Muzny director
Quantity | Value | Units | Method | Reference | Comment |
---|---|---|---|---|---|
Tboil | 577.2 | K | N/A | Serijan and Wise, 1952, 2 | Uncertainty assigned by TRC = 0.6 K |

References

Serijan and Wise, 1952
Serijan, K.T.; Wise, P.H.,
Dicyclic hydrocarbons. V. Synthesis and physical properties of the diphenyl- and dicyclohexylbutanes,
J. Am. Chem. Soc., 1952, 74, 365-368. [all data]
Serijan and Wise, 1952, 2
Serijan, K.T.; Wise, P.H.,
Dicyclic hydrocarbons. V. Synthesis and physical properties of the diphenyl - and dicyclohexylbutanes,
J. Am. Chem. Soc., 1952, 74, 365-8. [all data]