N-Nitro-N'-aminoguanidine
- Formula: CH5N5O2
- Molecular weight: 119.0827
- IUPAC Standard InChIKey: LWPLPMSGDZDOLW-UHFFFAOYSA-N
- CAS Registry Number: 27256-18-4
- Chemical structure:
View 3d structure (requires JavaScript / HTML 5) - Species with the same structure:

Condensed phase thermochemistry data

Data compiled by: Hussein Y. Afeefy, Joel F. Liebman, and Stephen E. Stein
Quantity | Value | Units | Method | Reference | Comment |
---|---|---|---|---|---|
ΔfH°solid | 22.2 | kJ/mol | Ccb | McEwan and Rigg, 1951 | |
Quantity | Value | Units | Method | Reference | Comment |
ΔcH°solid | -1130.3 ± 0.75 | kJ/mol | Ccb | McEwan and Rigg, 1951 |

References

McEwan and Rigg, 1951
McEwan, W.S.; Rigg, M.W.,
The heats of combustion of compounds containing the tetrazole ring,
J. Am. Chem. Soc., 1951, 73, 4725-4727. [all data]