Tridecanoic acid, 12-methyl
- Formula: C14H28O2
- Molecular weight: 228.3709
- IUPAC Standard InChIKey: YYVJAABUJYRQJO-UHFFFAOYSA-N
- CAS Registry Number: 2724-57-4
- Chemical structure:
View 3d structure (requires JavaScript / HTML 5) - Other names: 12-methyltridecanoic acid; 12-METHYL TRICADENOIC ACID

Phase change data

Data compiled by: Thermodynamics Research Center, NIST Boulder Laboratories, Chris Muzny director
Quantity | Value | Units | Method | Reference | Comment |
---|---|---|---|---|---|
Tfus | 328. | K | N/A | Liu, 1952 | Uncertainty assigned by TRC = 2. K |

Van Den Dool and Kratz RI, polar column, temperature ramp

Column type | Active phase | I | Reference | Comment |
---|---|---|---|---|
Capillary | DB-Wax | 2657. | Shiratsuchi, Shimoda, et al., 1994 | 60. m/0.25 mm/0.25 μm, He, 2. K/min, 230. C @ 60. min; Tstart: 50. C |

References

Liu, 1952
Liu, S.-L.,
Fatty Acids from Lanolin, Essays and Papers in Memory of Late President Fu Ssu-Nien 199-213 1952, 1952. [all data]
Shiratsuchi, Shimoda, et al., 1994
Shiratsuchi, H.; Shimoda, M.; Imayoshi, K.; Noda, K.; Osajima, Y.,
Volatile flavor compounds in spray-dried skim milk powder,
J. Agric. Food Chem., 1994, 42, 4, 984-988, https://doi.org/10.1021/jf00040a028
. [all data]