Isoundecanoic acid
- Formula: C12H24O2
- Molecular weight: 200.3178
- IUPAC Standard InChIKey: QJRRBVNPIKYRQJ-UHFFFAOYSA-N
- CAS Registry Number: 2724-56-3
- Chemical structure:
View 3d structure (requires JavaScript / HTML 5) - Other names: 10-methylundecanoic acid

Phase change data

Data compiled by: Thermodynamics Research Center, NIST Boulder Laboratories, Chris Muzny director
Quantity | Value | Units | Method | Reference | Comment |
---|---|---|---|---|---|
Tfus | 315.7 | K | N/A | Liu, 1952 | Uncertainty assigned by TRC = 1. K |

References

Liu, 1952
Liu, S.-L.,
Fatty Acids from Lanolin, Essays and Papers in Memory of Late President Fu Ssu-Nien 199-213 1952, 1952. [all data]