Carbamic acid, dimethyl-, 2-(formylmethylamino)-5,6-dimethyl-4-pyrimidinyl ester
- Formula: C11H16N4O3
- Molecular weight: 252.2697
- IUPAC Standard InChIKey: GDEAMEURJBBCOQ-UHFFFAOYSA-N
- CAS Registry Number: 27218-04-8
- Chemical structure:
View 3d structure (requires JavaScript / HTML 5) - Other names: Carbamic acid, dimethyl-, ester with N-(4-hydroxy-5,6-dimethyl-2-pyrimidinyl)-N-methylformamide; 2-[Formyl(methyl)amino]-5,6-dimethyl-4-pyrimidinyl dimethylcarbamate; Pyrimidin-4-ol, 2-formylmethylamino, 5,6-dimethyl, N,N-dimethylcarbamate; Pirimicarb II

Phase change data

Data compiled by: Thermodynamics Research Center, NIST Boulder Laboratories, Chris Muzny director
Quantity | Value | Units | Method | Reference | Comment |
---|---|---|---|---|---|
Tfus | 353.52 | K | N/A | Donnelly, Drewes, et al., 1990 | Uncertainty assigned by TRC = 0.2 K |

References

Donnelly, Drewes, et al., 1990
Donnelly, J.R.; Drewes, L.A.; Johnson, R.L.; Munslow, W.D.; Knapp, K.K.; Sovocool, G.W.,
Purity and heat of fusion data for environmental standards as determined by differential scanning calorimetry,
Thermochim. Acta, 1990, 167, 2, 155, https://doi.org/10.1016/0040-6031(90)80476-F
. [all data]