1-Pyrazoline
- Formula: C3H6N2
- Molecular weight: 70.0931
- IUPAC Standard InChIKey: DNXIASIHZYFFRO-UHFFFAOYSA-N
- CAS Registry Number: 2721-43-9
- Chemical structure:
View 3d structure (requires JavaScript / HTML 5) - Permanent link for this species. Use this link for bookmarking this species for future reference.

Normal alkane RI, non-polar column, custom temperature program

Column type | Active phase | I | Reference | Comment |
---|---|---|---|---|
Capillary | Methyl Silicone | 697. | Zenkevich, 1996 | Program: not specified |

References

Zenkevich, 1996
Zenkevich, I.G.,
Informational Maitenance of Gas Chromatographic Identification of Organic Compounds in Ecoanalytical Investigations,
Z. Anal. Chem., 1996, 51, 11, 1140-1148. [all data]