2H-Pyran-2-one, tetrahydro-6-nonyl-
- Formula: C14H26O2
- Molecular weight: 226.3550
- IUPAC Standard InChIKey: SKQYTJLYRIFFCO-UHFFFAOYSA-N
- CAS Registry Number: 2721-22-4
- Chemical structure:
View 3d structure (requires JavaScript / HTML 5) - Other names: δ-Nonyl-δ-valeralactone; δ-Tetradecalactone; δ-tetradecaIactone; 6-Nonyltetrahydro-2H-pyran-2-one; tetrahydro-6-nonyl-2H-pyran-2-one

Van Den Dool and Kratz RI, polar column, temperature ramp

Column type | Active phase | I | Reference | Comment |
---|---|---|---|---|
Capillary | DB-Wax | 2701. | Shimoda, Yoshimura, et al., 2001 | 60. m/0.25 mm/0.25 μm, He, 2. K/min, 230. C @ 60. min; Tstart: 50. C |

Normal alkane RI, non-polar column, custom temperature program

Column type | Active phase | I | Reference | Comment |
---|---|---|---|---|
Capillary | DB-5 MS | 1938. | Watanabe, Ueda, et al., 2008 | 30. m/0.32 mm/1.0 μm, Helium; Program: -10 0C (3 min) 50 0C/min -> 40 0C 5 0C/min -> 290 0C (5 min) |

Normal alkane RI, polar column, temperature ramp

Column type | Active phase | I | Reference | Comment |
---|---|---|---|---|
Capillary | EC-1000 | 2675. | Bendall, 2001 | 30. m/0.25 mm/0.25 μm, He, 35. C @ 5. min, 5. K/min, 230. C @ 15. min |

References

Shimoda, Yoshimura, et al., 2001
Shimoda, M.; Yoshimura, Y.; Yoshimura, T.; Noda, K.; Osajima, Y.,
Volatile flavor compounds of sweetened condensed milk,
J. Food Sci., 2001, 66, 6, 804-807, https://doi.org/10.1111/j.1365-2621.2001.tb15176.x
. [all data]
Watanabe, Ueda, et al., 2008
Watanabe, A.; Ueda, Y.; Higuchi, M.; Shiba, N.,
Analysis of volatile compounds in beef fat by dinamic-headspace solid phase microextraction combined with gas chromatography - mass spectrometry,
J. Food Sci., 2008, 73, 5, 420-425, https://doi.org/10.1111/j.1750-3841.2008.00764.x
. [all data]
Bendall, 2001
Bendall, J.G.,
Aroma compounds of fresh milk from New Zealand cows fed different diets,
J. Agric. Food Chem., 2001, 49, 10, 4825-4832, https://doi.org/10.1021/jf010334n
. [all data]