Benzamide
- Formula: C7H7NO
- Molecular weight: 121.1366
- IUPAC Standard InChIKey: KXDAEFPNCMNJSK-UHFFFAOYSA-N
- CAS Registry Number: 27208-38-4
- Chemical structure:
View 3d structure (requires JavaScript / HTML 5) - Species with the same structure:

Gas phase thermochemistry data

Data compiled by: Hussein Y. Afeefy, Joel F. Liebman, and Stephen E. Stein
Quantity | Value | Units | Method | Reference | Comment |
---|---|---|---|---|---|
ΔfH°gas | -100.9 ± 1.2 | kJ/mol | Ccr | Gomez and Sabbah, 1982 |

Condensed phase thermochemistry data

Data compiled by: Hussein Y. Afeefy, Joel F. Liebman, and Stephen E. Stein
Quantity | Value | Units | Method | Reference | Comment |
---|---|---|---|---|---|
ΔfH°solid | -202.14 ± 0.60 | kJ/mol | Ccb | Steele, Chirico, et al., 1990 | |
Quantity | Value | Units | Method | Reference | Comment |
ΔcH°solid | -3552.83 ± 0.50 | kJ/mol | Ccb | Steele, Chirico, et al., 1990 |

Phase change data

Data compiled by: Hussein Y. Afeefy, Joel F. Liebman, and Stephen E. Stein
Quantity | Value | Units | Method | Reference | Comment |
---|---|---|---|---|---|
ΔsubH° | 101.7 ± 1.0 | kJ/mol | C | Gomez and Sabbah, 1982 |

References

Gomez and Sabbah, 1982
Gomez, L.A.T.; Sabbah, R.,
Thermodynamique de substances azotees. IX. Etude thermochimique de la benzamide. Comparaison des grandeurs energetiques liees a la structure de quelques amides et thioamides,
Thermochim. Acta, 1982, 58, 311-315. [all data]
Steele, Chirico, et al., 1990
Steele, W.V.; Chirico, R.D.; Nguyen, A.; Hossenlopp, I.A.; Smith, N.K.,
Determination of ideal-gas enthalpies of formation for key compounds,
Am. Inst. Chem. Eng. Symp. Ser. (AIChE Symp. Ser.), 1990, 138-154. [all data]