Benzene, (1-propylnonyl)-
- Formula: C18H30
- Molecular weight: 246.4308
- IUPAC Standard InChIKey: RHDHXBLZBVAPTL-UHFFFAOYSA-N
- CAS Registry Number: 2719-64-4
- Chemical structure:
View 3d structure (requires JavaScript / HTML 5) - Other names: Dodecane, 4-phenyl-; 4-Phenyldodecane; (1-Propylnonyl)benzene

Phase change data

Data compiled by: Thermodynamics Research Center, NIST Boulder Laboratories, Chris Muzny director
Quantity | Value | Units | Method | Reference | Comment |
---|---|---|---|---|---|
Tfus | 249.15 | K | N/A | Petrov, Lapteva, et al., 1944 | Uncertainty assigned by TRC = 2. K |

Kovats' RI, non-polar column, isothermal

Column type | Active phase | Temperature (C) | I | Reference | Comment |
---|---|---|---|---|---|
Capillary | OV-101 | 185. | 1734. | Lesko, Holotík, et al., 1976 | N2; Column length: 50. m; Column diameter: 0.25 mm |
Capillary | Apiezon | 200. | 1741. | Schomburg, 1966 |

Van Den Dool and Kratz RI, non-polar column, temperature ramp

Column type | Active phase | I | Reference | Comment |
---|---|---|---|---|
Capillary | DB-1 | 1735. | Peng, Hua, et al., 1992 | 30. m/0.32 mm/1.5 μm, 40. C @ 4. min, 8. K/min; Tend: 280. C |

Van Den Dool and Kratz RI, polar column, temperature ramp

Column type | Active phase | I | Reference | Comment |
---|---|---|---|---|
Capillary | DB-Wax | 1943. | Peng, Hua, et al., 1992 | 30. m/0.53 mm/1. μm, 40. C @ 4. min, 8. K/min, 200. C @ 20. min |

Lee's RI, non-polar column, custom temperature program

Column type | Active phase | I | Reference | Comment |
---|---|---|---|---|
Capillary | SE-54 | 295.5 | Peterman and Delfino, 1990 | 15. m/0.25 mm/0.25 μm, He; Program: 125 0C (15 min) 1 0C/min -> 131 0C 4 0C/min -> 247 0C 8 0C/min -> 280 0C (15 min) |

References

Petrov, Lapteva, et al., 1944
Petrov, A.D.; Lapteva, E.I.; Pchelkina, A.I.,
Synthesis and Properties of Some Higher Benzene Homologs,
J. Gen. Chem. USSR (Engl. Transl.), 1944, 14, 495. [all data]