Benzene, (1-methylundecyl)-
- Formula: C18H30
- Molecular weight: 246.4308
- IUPAC Standard InChIKey: VRPRIAVYSREHAN-UHFFFAOYSA-N
- CAS Registry Number: 2719-61-1
- Chemical structure:
View 3d structure (requires JavaScript / HTML 5) - Other names: Dodecane, 2-phenyl-; 2-Phenyldodecane

Phase change data

Data compiled by: Thermodynamics Research Center, NIST Boulder Laboratories, Chris Muzny director
Quantity | Value | Units | Method | Reference | Comment |
---|---|---|---|---|---|
Tboil | 575.7 | K | N/A | Plaskunova, Shapovalova, et al., 1986 | Uncertainty assigned by TRC = 0.5 K |

Kovats' RI, non-polar column, isothermal

Column type | Active phase | Temperature (C) | I | Reference | Comment |
---|---|---|---|---|---|
Capillary | OV-101 | 185. | 1797. | Lesko, Holotík, et al., 1976 | N2; Column length: 50. m; Column diameter: 0.25 mm |
Capillary | Apiezon | 200. | 1813. | Schomburg, 1966 |

Van Den Dool and Kratz RI, non-polar column, temperature ramp

Column type | Active phase | I | Reference | Comment |
---|---|---|---|---|
Capillary | DB-1 | 1791. | Peng, Hua, et al., 1992 | 30. m/0.32 mm/1.5 μm, 40. C @ 4. min, 8. K/min; Tend: 280. C |

Van Den Dool and Kratz RI, polar column, temperature ramp

Column type | Active phase | I | Reference | Comment |
---|---|---|---|---|
Capillary | DB-Wax | 2036. | Peng, Hua, et al., 1992 | 30. m/0.53 mm/1. μm, 40. C @ 4. min, 8. K/min, 200. C @ 20. min |

Lee's RI, non-polar column, custom temperature program

Column type | Active phase | I | Reference | Comment |
---|---|---|---|---|
Capillary | SE-54 | 304.8 | Peterman and Delfino, 1990 | 15. m/0.25 mm/0.25 μm, He; Program: 125 0C (15 min) 1 0C/min -> 131 0C 4 0C/min -> 247 0C 8 0C/min -> 280 0C (15 min) |

References

Plaskunova, Shapovalova, et al., 1986
Plaskunova, S.L.; Shapovalova, I.M.; Serebryakov, B.P.,
Azerb. Khim. Zh., 1986, No. 4, 96-9. [all data]
Lesko, Holotík, et al., 1976
Lesko, J.; Holotík, S.; Krupcík, J.; Veselý, V.,
Gas Chromatographic and Mass Spectrometric Analysis of a Commercial Mixture of Phenylalkanes (Detergent Alkylates),
J. Chromatogr., 1976, 119, 293-306, https://doi.org/10.1016/S0021-9673(00)86793-X
. [all data]
Schomburg, 1966
Schomburg, G.,
Gaschromatographische Retentionsdaten und struktur chemischer verbindungen. III. Alkylverzweigte und ungesättigte cyclische Kohlenwasserstoffe,
J. Chromatogr., 1966, 23, 18-41, https://doi.org/10.1016/S0021-9673(01)98653-4
. [all data]
Peng, Hua, et al., 1992
Peng, C.T.; Hua, R.L.; Maltby, D.,
Prediction of retention indexes. IV. Chain branching in alkylbenzene isomers with C10-13 alkyl chains identified in a scintillator solvent,
J. Chromatogr., 1992, 589, 1-2, 231-239, https://doi.org/10.1016/0021-9673(92)80027-R
. [all data]
Peterman and Delfino, 1990
Peterman, P.H.; Delfino, J.J.,
Identification of isopropylbiphenyl, alkyl diphenylmethanes, diisopropylnaphthalene, linear alkyl benzenes and other polychlorinated biphenyl replacement compounds in effluents, sediments and fish in the Fox River system, Wisconsin,
Biomed. Environ. Mass Spectrom., 1990, 19, 12, 755-770, https://doi.org/10.1002/bms.1200191203
. [all data]