1,2-Benzisoxazole
- Formula: C7H5NO
- Molecular weight: 119.1207
- IUPAC Standard InChIKey: KTZQTRPPVKQPFO-UHFFFAOYSA-N
- CAS Registry Number: 271-95-4
- Chemical structure:
View 3d structure (requires JavaScript / HTML 5) - Other names: Indoxazene; 1-Oxa-2-azaindene; 1-Oxa-2-aza-1H-indene; 4,5-Benzisoxazole; 4,5-Benzisoazole; benz[d]isoxazole

Reaction thermochemistry data

Data compiled by: Hussein Y. Afeefy, Joel F. Liebman, and Stephen E. Stein
Individual Reactions
By formula: C7H5NO = C7H5NO
Quantity | Value | Units | Method | Reference | Comment |
---|---|---|---|---|---|
ΔrH° | -112. ± 8.4 | kJ/mol | Ciso | Casey, Kemp, et al., 1973 | liquid phase; solvent: Aq/ethanol; Hydrolsis |

Phase change data

Data compiled by: Robert L. Brown and Stephen E. Stein
Reduced pressure boiling point
Tboil (K) | Pressure (bar) | Reference |
---|---|---|
364.2 | 0.020 | Aldrich Chemical Company Inc., 1990 |

References

Casey, Kemp, et al., 1973
Casey, M.L.; Kemp, D.S.; Paul, K.G.; Cox, D.D.,
The physical organic chemistry of benzisoxazoles. I. The mechanism of the base-catalyzed decomposition of benzisoxazoles,
J. Org. Chem., 1973, 38, 2294-2300. [all data]