3-Chloro-4-methylbenzyl chloride
- Formula: C8H8Cl2
- Molecular weight: 175.055
- IUPAC Standard InChIKey: JTMYLQKKQFLIGV-UHFFFAOYSA-N
- CAS Registry Number: 2719-40-6
- Chemical structure:
View 3d structure (requires JavaScript / HTML 5) - Isotopologues:
- Other names: 2-Chloro-4-chloromethyltoluene; 3-Chloro-1-(Chloromethyl)-4-methylbenzene; Benzene, 2-chloro-4-(chloromethyl)-1-methyl; Benzene, 3-chloro-1-chloromethyl-4-methyl

Phase change data

Data compiled by: Robert L. Brown and Stephen E. Stein
Reduced pressure boiling point
Tboil (K) | Pressure (bar) | Reference |
---|---|---|
398. to 403. | 0.027 | Frinton Laboratories Inc., 1986 |

References

Frinton Laboratories Inc., 1986
Frinton Laboratories Inc.,
Catalog Number 11, Frinton Laboratories Inc., Vineland, NJ, 1986, 99. [all data]