Cyclohexanecarbonyl chloride
- Formula: C7H11ClO
- Molecular weight: 146.615
- IUPAC Standard InChIKey: RVOJTCZRIKWHDX-UHFFFAOYSA-N
- CAS Registry Number: 2719-27-9
- Chemical structure:
View 3d structure (requires JavaScript / HTML 5) - Other names: Chlorocarbonylcyclohexane; Cyclohexanoyl chloride; Cyclohexylcarbonyl chloride; Hexahydrobenzoyl chloride; Cyclohexanecarboxylic acid chloride

Phase change data

Data compiled as indicated in comments:
BS - Robert L. Brown and Stephen E. Stein
TRC - Thermodynamics Research Center, NIST Boulder Laboratories, Chris Muzny director
Quantity | Value | Units | Method | Reference | Comment |
---|---|---|---|---|---|
Tboil | 457.2 | K | N/A | Aldrich Chemical Company Inc., 1990 | BS |
Tboil | 454. | K | N/A | Yamase, 1961 | Uncertainty assigned by TRC = 4. K; TRC |
Tboil | 457. | K | N/A | Lumsden, 1905 | Uncertainty assigned by TRC = 3. K; TRC |
Reduced pressure boiling point
Tboil (K) | Pressure (bar) | Reference | Comment |
---|---|---|---|
350. to 351. | 0.027 | Frinton Laboratories Inc., 1986 | BS |

References

Aldrich Chemical Company Inc., 1990
Aldrich Chemical Company Inc.,
Catalog Handbook of Fine Chemicals, Aldrich Chemical Company, Inc., Milwaukee WI, 1990, 1. [all data]
Yamase, 1961
Yamase, Y.,
Friedel-Crafts Acylation II. Relative Reactivity for Some Acyl Halides,
Bull. Chem. Soc. Jpn., 1961, 34, 480-84. [all data]
Lumsden, 1905
Lumsden, J.S.,
The physical properties of heptoic, hexahydrobenzoic, and benzoic acids and their derivatives,
J. Chem. Soc., 1905, 87, 90-98. [all data]
Frinton Laboratories Inc., 1986
Frinton Laboratories Inc.,
Catalog Number 11, Frinton Laboratories Inc., Vineland, NJ, 1986, 99. [all data]