Benzoic acid, 2-(acetylamino)-, methyl ester
- Formula: C10H11NO3
- Molecular weight: 193.1992
- IUPAC Standard InChIKey: UYQKZKVNYKOXHG-UHFFFAOYSA-N
- CAS Registry Number: 2719-08-6
- Chemical structure:
View 3d structure (requires JavaScript / HTML 5) - Other names: Anthranilic acid, N-acetyl-, methyl ester; Methyl N-acetylanthranilate; Methyl N-acetoanthranilate; 2-Acetylaminobenzoic acid, methyl ester; N-Acetyl methyl anthranilate; Methyl 2-(N-acetylamino)benzoate; Methyl 2-(acetylamino)benzoate; Methyl 2-acetamidobenzoate

Van Den Dool and Kratz RI, non-polar column, temperature ramp

Column type | Active phase | I | Reference | Comment |
---|---|---|---|---|
Capillary | VF-5MS | 1622. | Todua, 2011 | 30. m/0.25 mm/0.25 μm, He; Tstart: 60. C; Tend: 270. C |

Van Den Dool and Kratz RI, non-polar column, custom temperature program

Column type | Active phase | I | Reference | Comment |
---|---|---|---|---|
Capillary | HP-5MS | 1607. | Andriamaharavo, 2014 | 30. m/0.25 mm/0.25 μm, He; Program: 60C (1 min) => 5 C/min => 210C => 10 C/min => 280C (15 min) |

References

Todua, 2011
Todua, N.G.,
Retention Data. NIST Mass Spectrometry Data Center., NIST Mass Spectrometry Data Center, 2011. [all data]
Andriamaharavo, 2014
Andriamaharavo, N.R.,
Retention Data. NIST Mass Spectrometry Data Center., NIST Mass Spectrometry Data Center, 2014. [all data]