Benzofuran
- Formula: C8H6O
- Molecular weight: 118.1326
- IUPAC Standard InChIKey: IANQTJSKSUMEQM-UHFFFAOYSA-N
- CAS Registry Number: 271-89-6
- Chemical structure:
View 3d structure (requires JavaScript / HTML 5) - Other names: Benzofurfuran; Benzo[b]furan; Coumarone; 1-Oxindene; 2,3-Benzofuran; NCI-C56166; Cumarone

Gas phase thermochemistry data

Data compiled by: Hussein Y. Afeefy, Joel F. Liebman, and Stephen E. Stein
Quantity | Value | Units | Method | Reference | Comment |
---|---|---|---|---|---|
ΔfH°gas | 13.6 ± 0.7 | kJ/mol | Ccb | Steele and Chirico, 1990 |

Condensed phase thermochemistry data

Data compiled as indicated in comments:
ALS - Hussein Y. Afeefy, Joel F. Liebman, and Stephen E. Stein
DH - Eugene S. Domalski and Elizabeth D. Hearing
Quantity | Value | Units | Method | Reference | Comment |
---|---|---|---|---|---|
ΔfH°liquid | -8.32 ± 0.16 | kcal/mol | Ccb | Steele and Chirico, 1990 | ALS |
Quantity | Value | Units | Method | Reference | Comment |
ΔcH°liquid | -949.03 ± 0.14 | kcal/mol | Ccb | Steele and Chirico, 1990 | Corresponding ΔfHºliquid = -8.325 kcal/mol (simple calculation by NIST; no Washburn corrections); ALS |
Quantity | Value | Units | Method | Reference | Comment |
S°liquid | 51.527 | cal/mol*K | N/A | Chirico, Nguyen, et al., 1986 | DH |
Constant pressure heat capacity of liquid
Cp,liquid (cal/mol*K) | Temperature (K) | Reference | Comment |
---|---|---|---|
42.710 | 298.15 | Chirico, Nguyen, et al., 1986 | T = 10 to 450 K.; DH |

Phase change data

Data compiled as indicated in comments:
BS - Robert L. Brown and Stephen E. Stein
TRC - Thermodynamics Research Center, NIST Boulder Laboratories, Chris Muzny director
ALS - Hussein Y. Afeefy, Joel F. Liebman, and Stephen E. Stein
DRB - Donald R. Burgess, Jr.
AC - William E. Acree, Jr., James S. Chickos
DH - Eugene S. Domalski and Elizabeth D. Hearing
Quantity | Value | Units | Method | Reference | Comment |
---|---|---|---|---|---|
Tboil | 447.2 | K | N/A | Weast and Grasselli, 1989 | BS |
Tboil | 444.15 | K | N/A | Cooper, Crowne, et al., 1967 | Uncertainty assigned by TRC = 0.5 K; TRC |
Tboil | 442.15 | K | N/A | Gordy and Burrus, 1954 | Uncertainty assigned by TRC = 1.5 K; TRC |
Tboil | 447.15 | K | N/A | Perkin, 1896 | Uncertainty assigned by TRC = 0.5 K; TRC |
Quantity | Value | Units | Method | Reference | Comment |
ΔvapH° | 11.6 ± 0.05 | kcal/mol | V | Steele and Chirico, 1990 | ALS |
ΔvapH° | 11.6 | kcal/mol | N/A | Steele and Chirico, 1990 | DRB |
Reduced pressure boiling point
Tboil (K) | Pressure (atm) | Reference | Comment |
---|---|---|---|
335. to 336. | 0.020 | Frinton Laboratories Inc., 1986 | BS |
439.6 to 441. | 0.967 | Buckingham and Donaghy, 1982 | BS |
370.6 to 372. | 0.11 | Buckingham and Donaghy, 1982 | BS |
Enthalpy of vaporization
ΔvapH (kcal/mol) | Temperature (K) | Method | Reference | Comment |
---|---|---|---|---|
11.0 | 338. | A | Stephenson and Malanowski, 1987 | Based on data from 323. to 403. K.; AC |
Temperature of phase transition
Ttrs (K) | Initial Phase | Final Phase | Reference | Comment |
---|---|---|---|---|
232.000 | crystaline, II | crystaline, I | Chirico, Nguyen, et al., 1986 | DH |
245.482 | crystaline, I | liquid | Chirico, Nguyen, et al., 1986 | DH |

Gas phase ion energetics data

Data evaluated as indicated in comments:
L - Sharon G. Lias
Data compiled as indicated in comments:
LLK - Sharon G. Lias, Rhoda D. Levin, and Sherif A. Kafafi
RDSH - Henry M. Rosenstock, Keith Draxl, Bruce W. Steiner, and John T. Herron
Quantity | Value | Units | Method | Reference | Comment |
---|---|---|---|---|---|
IE (evaluated) | 8.36 ± 0.05 | eV | N/A | N/A | L |
Ionization energy determinations
IE (eV) | Method | Reference | Comment |
---|---|---|---|
8.8 | EI | Tang, McGowan, et al., 1979 | LLK |
8.37 ± 0.015 | PE | Gusten, Klasinc, et al., 1976 | LLK |
8.85 ± 0.05 | EI | Thorstad and Undheim, 1974 | LLK |
8.42 | PE | Dewar, Harget, et al., 1970 | RDSH |
8.29 ± 0.05 | PE | Eland, 1969 | RDSH |
Appearance energy determinations
Ion | AE (eV) | Other Products | Method | Reference | Comment |
---|---|---|---|---|---|
C7H6+ | 12.52 | CO | EI | Occolowitz and White, 1968 | RDSH |

Normal alkane RI, non-polar column, custom temperature program

Data compiled by: NIST Mass Spectrometry Data Center, William E. Wallace, director

Column type CapillaryCapillaryCapillaryCapillaryCapillary
Active phase Polydimethyl siloxane with 5 % Ph groupsPolydimethyl siloxane with 5 % Ph groupsDB-5HP-5HP-5
Column length (m)   30.30.30.
Carrier gas
Substrate
Column diameter (mm)   0.250.250.25
Phase thickness (μm)   0.250.250.25
Program not specifiednot specified40 0C (5 min) 5 0C/min -> 260 0C 15 0C/min -> 280 0C (1 min)40 0C (2 min) 5 0C/min -> 80 0C 7 oC/min -> 160 0C 9 0C/min -> 200 0C 20 0C/min -> 280 0C (10 min)not specified
I 1003.1007.988.995.1005.
ReferenceRobinson, Adams, et al., 2012Robinson, Adams, et al., 2012Yu and Zhang, 2010Zhao, Li, et al., 2008Zhao, Li, et al., 2008
Comment MSDC-RI MSDC-RI MSDC-RI MSDC-RI MSDC-RI
Column type CapillaryCapillaryCapillaryCapillary
Active phase Methyl phenyl siloxane (not specified)DB-5Polydimethyl siloxane, unknown content of Ph-groupsPolydimethyl siloxane, unknown content of Ph-groups
Column length (m)  50.
Carrier gas  He
Substrate
Column diameter (mm)  0.32
Phase thickness (μm)  0.25
Program not specified40C (10min) => 3C/min => 95C => 10C/min => 270C (10min)not specifiednot specified
I 1007.1005.991.996.
ReferencePoligne, Collignan, et al., 2002Mateo and Zumalacárregui, 1996Geldon, 1989Geldon, 1989
Comment MSDC-RI MSDC-RI MSDC-RI MSDC-RI

Normal alkane RI, non-polar column, temperature ramp

Data compiled by: NIST Mass Spectrometry Data Center, William E. Wallace, director

Column type CapillaryCapillaryCapillary
Active phase ZB-5SPB-5DB-1
Column length (m) 30.60.60.
Carrier gas HeliumHeHe
Substrate
Column diameter (mm) 0.250.320.32
Phase thickness (μm) 0.251.1.
Tstart (C) 40.40.40.
Tend (C) 280.200.280.
Heat rate (K/min) 6.3.2.
Initial hold (min) 1. 2.
Final hold (min) 9. 40.
I 1000.1006.968.
ReferenceHarrison and Priest, 2009Poligné, Collignan, et al., 2001Lu, Yu, et al., 1997
Comment MSDC-RI MSDC-RI MSDC-RI

References

Steele and Chirico, 1990
Steele, W.V.; Chirico, R.D.,
Thermodynamics and the hydrodeoxygenation of 2,3-Benzofuran,
Cooperative Agreement No. FC22-83FE60149 (NIPEP-457), IIT Research Institute, NIPEP, Bartlesville, OK 74005, 1990, 1-75. [all data]