2-Cyclohexen-1-one, 2,4,4-trimethyl-3-(3-oxo-1-butenyl)-
- Formula: C13H18O2
- Molecular weight: 206.2808
- IUPAC Standard InChIKey: OBHGOXFSRVNKBS-AATRIKPKSA-N
- CAS Registry Number: 27185-77-9
- Chemical structure:
View 3d structure (requires JavaScript / HTML 5) - Species with the same structure:
- Other names: 3-Keto-β-ionone; 2,4,4-Trimethyl-3-(3-oxo-1-butenyl)-2-cyclohexen-1-one; 2-Cyclohexen-1-one, 2,4,4-trimethyl-3-(3-oxo-1-buten-1-yl)-; (E)-4-Oxo-β-ionone; 2,4,4-trimethyl-3-(3-oxo-1-butenyl)cyclohex-2-en-1-one

Normal alkane RI, non-polar column, temperature ramp

Column type | Active phase | I | Reference | Comment |
---|---|---|---|---|
Capillary | HP-5 MS | 1661. | Radulovic, Blagojevic, et al., 2009 | 30. m/0.25 mm/0.25 μm, Helium, 5. K/min, 290. C @ 10. min; Tstart: 70. C |

References

Radulovic, Blagojevic, et al., 2009
Radulovic, N.S.; Blagojevic, P.D.; Palic, R.M.; Zlatkovic, B.K.; Stevanovic, B.M.,
Volatiles from vegetative organs of the paleoendemic resurrection plants Ramonda serbica Panc. and Ramonda nathaliae Panc. at Petrov,
J. Serb. Chem. Soc., 2009, 74, 1, 35-44, https://doi.org/10.2298/JSC0901035R
. [all data]