Ethene, dichlorodifluoro-
- Formula: C2Cl2F2
- Molecular weight: 132.924
- IUPAC Standard InChIKey: QDGONURINHVBEW-UHFFFAOYSA-N
- CAS Registry Number: 27156-03-2
- Chemical structure:
View 3d structure (requires JavaScript / HTML 5) - Species with the same structure:
- Other names: Dichlorodifluoroethylene

Phase change data

Antoine Equation Parameters
log10(P) = A − (B / (T + C))
P = vapor pressure (bar)
T = temperature (K)
View plot Requires a JavaScript / HTML 5 canvas capable browser.
Temperature (K) | A | B | C | Reference | Comment |
---|---|---|---|---|---|
239.90 to 295.00 | 4.07301 | 1023.135 | -42.265 | Booth, Burchfield, et al., 1933 | Coefficents calculated by NIST from author's data. |

References

Booth, Burchfield, et al., 1933
Booth, Harold Simmons; Burchfield, Paul E.; Bixby, Eva May; McKelvey, J.B.,
Fluorochloroethylenes,
J. Am. Chem. Soc., 1933, 55, 6, 2231-2235, https://doi.org/10.1021/ja01333a005
. [all data]