Hydrobenzoin
- Formula: C14H14O2
- Molecular weight: 214.2598
- IUPAC Standard InChIKey: IHPDTPWNFBQHEB-UHFFFAOYSA-N
- CAS Registry Number: 27134-24-3
- Chemical structure:
View 3d structure (requires JavaScript / HTML 5) - Stereoisomers:

Condensed phase thermochemistry data

Data compiled by: Hussein Y. Afeefy, Joel F. Liebman, and Stephen E. Stein
Quantity | Value | Units | Method | Reference | Comment |
---|---|---|---|---|---|
ΔcH°solid | -7195.53 | kJ/mol | Ccb | Verkade and Coops, 1928 | At 288 K; Corresponding ΔfHºsolid = -314.42 kJ/mol (simple calculation by NIST; no Washburn corrections) |

References

Verkade and Coops, 1928
Verkade, P.E.; Coops, J., Jr.,
The ratio of the heats of combustion of benzoic acid and salicylic acid,
Recl. Trav. Chim. Pays-Bas, 1928, 47, 709-714. [all data]