α-Bromomesitylene
- Formula: C9H11Br
- Molecular weight: 199.088
- IUPAC Standard InChIKey: QXDHXCVJGBTQMK-UHFFFAOYSA-N
- CAS Registry Number: 27129-86-8
- Chemical structure:
View 3d structure (requires JavaScript / HTML 5) - Other names: 3,5-Dimethylbenzyl bromide; Benzene, 1-(bromomethyl)-3,5-dimethyl-; 1-(Bromomethyl)-3,5-dimethylbenzene; alpha-Bromomesitylene

Phase change data

Data compiled by: Robert L. Brown and Stephen E. Stein
Reduced pressure boiling point
Tboil (K) | Pressure (bar) | Reference |
---|---|---|
381. to 384. | 0.020 | Frinton Laboratories Inc., 1986 |

References

Frinton Laboratories Inc., 1986
Frinton Laboratories Inc.,
Catalog Number 11, Frinton Laboratories Inc., Vineland, NJ, 1986, 99. [all data]