3,5-Bis(trifluoromethyl)benzonitrile
- Formula: C9H3F6N
- Molecular weight: 239.1172
- IUPAC Standard InChIKey: CZKHHAOIHXHOSR-UHFFFAOYSA-N
- CAS Registry Number: 27126-93-8
- Chemical structure:
View 3d structure (requires JavaScript / HTML 5) - Other names: 3,5-di(Trifluoromethyl)benzonitrile; Bis(3,5-trifluoromethyl)benzonitrile; Benzonitrile, 3,5-bis(trifluoromethyl)-; 3,5-Bis(trifluoromethyl)-1-cyanobenzene

Gas phase ion energetics data

Data compiled by: John E. Bartmess
Electron affinity determinations
EA (eV) | Method | Reference | Comment |
---|---|---|---|
1.140 ± 0.087 | IMRE | Chowdhury and Kebarle, 1986 | ΔGea(423 K) = -26.3 kcal/mol; ΔSea (estimated) = 0 eu |

References

Chowdhury and Kebarle, 1986
Chowdhury, S.; Kebarle, P.,
Electron affinities of di- and tetracyanoethylene and cyanobenzenes based on measurements of gas-phase electron transfer equilibria,
J. Am. Chem. Soc., 1986, 108, 5453. [all data]