5-Norbornene-2-carbonyl chloride
- Formula: C8H9ClO
- Molecular weight: 156.609
- IUPAC Standard InChIKey: HXYXVFUUHSZSNV-UHFFFAOYSA-N
- CAS Registry Number: 27063-48-5
- Chemical structure:
View 3d structure (requires JavaScript / HTML 5) - Other names: Bicyclo[2.2.1]hept-5-ene-2-carbonyl chloride; Bicyclo[2.2.1]-5-heptene-2-carbonyl chloride

Phase change data

Data compiled by: Robert L. Brown and Stephen E. Stein
Reduced pressure boiling point
Tboil (K) | Pressure (bar) | Reference |
---|---|---|
357. to 360. | 0.020 | Frinton Laboratories Inc., 1986 |

References

Frinton Laboratories Inc., 1986
Frinton Laboratories Inc.,
Catalog Number 11, Frinton Laboratories Inc., Vineland, NJ, 1986, 99. [all data]