di-2-propenyl sulfate
- Formula: C6H10O4S
- Molecular weight: 178.206
- IUPAC Standard InChIKey: KVVXFPNTQJIKNH-UHFFFAOYSA-N
- CAS Registry Number: 27063-40-7
- Chemical structure:
View 3d structure (requires JavaScript / HTML 5) - Permanent link for this species. Use this link for bookmarking this species for future reference.

Phase change data

Data compiled by: Thermodynamics Research Center, NIST Boulder Laboratories, Chris Muzny director
Quantity | Value | Units | Method | Reference | Comment |
---|---|---|---|---|---|
Tfus | 190. | K | N/A | Timmermans, 1922 | Uncertainty assigned by TRC = 4. K |

References

Timmermans, 1922
Timmermans, J.,
Investigation of the Freezing Point of Organic Substances VII,
Bull. Soc. Chim. Belg., 1922, 31, 389. [all data]