3-Cyclopentylcyclopentene
- Formula: C10H16
- Molecular weight: 136.2340
- IUPAC Standard InChIKey: UWHATVBKIRLRTB-UHFFFAOYSA-N
- CAS Registry Number: 2690-17-7
- Chemical structure:
View 3d structure (requires JavaScript / HTML 5) - Permanent link for this species. Use this link for bookmarking this species for future reference.

Phase change data

Data compiled by: Thermodynamics Research Center, NIST Boulder Laboratories, Chris Muzny director
Quantity | Value | Units | Method | Reference | Comment |
---|---|---|---|---|---|
Tboil | 459.45 | K | N/A | Boord, Greenlee, et al., 1949 | Uncertainty assigned by TRC = 0.6 K |
Quantity | Value | Units | Method | Reference | Comment |
Tfus | 216.25 | K | N/A | Boord, Greenlee, et al., 1949 | Uncertainty assigned by TRC = 0.6 K |

References

Boord, Greenlee, et al., 1949
Boord, C.E.; Greenlee, K.W.; Perilstein, W.L.; Derfer, J.M.,
The Synthesis, Purification and Prop. of Hydrocarbons of Low Mol. Wt., Am. Pet. Inst. Res. Proj. 45, Eleventh Annu. Rep., Ohio State Univ., 1949. [all data]