2-Aminodiphenyl ether
- Formula: C12H11NO
- Molecular weight: 185.2218
- IUPAC Standard InChIKey: NMFFUUFPJJOWHK-UHFFFAOYSA-N
- CAS Registry Number: 2688-84-8
- Chemical structure:
View 3d structure (requires JavaScript / HTML 5) - Other names: 2-Phenoxyaniline; o-Phenoxyaniline; Benzenamine, 2-phenoxy-; o-Aminophenyl phenyl ether; Aniline, o-phenoxy-; Aniline, 2-phenoxy-; 2-Ade; 2-Aminophenyl phenyl ether; 2-Phenoxybenzenamine; NSC 39655

Phase change data

Data compiled by: Robert L. Brown and Stephen E. Stein
Quantity | Value | Units | Method | Reference | Comment |
---|---|---|---|---|---|
Tfus | 318.6 to 319. | K | N/A | Buckingham and Donaghy, 1982 |
Reduced pressure boiling point
Tboil (K) | Pressure (bar) | Reference |
---|---|---|
443.2 | 0.024 | Aldrich Chemical Company Inc., 1990 |
445.7 | 0.019 | Weast and Grasselli, 1989 |
445. to 446. | 0.019 | Buckingham and Donaghy, 1982 |

References

Buckingham and Donaghy, 1982
Buckingham, J.; Donaghy, S.M.,
Dictionary of Organic Compounds: Fifth Edition, Chapman and Hall, New York, 1982, 1. [all data]
Aldrich Chemical Company Inc., 1990
Aldrich Chemical Company Inc.,
Catalog Handbook of Fine Chemicals, Aldrich Chemical Company, Inc., Milwaukee WI, 1990, 1. [all data]
Weast and Grasselli, 1989
CRC Handbook of Data on Organic Compounds, 2nd Editon, Weast,R.C and Grasselli, J.G., ed(s)., CRC Press, Inc., Boca Raton, FL, 1989, 1. [all data]