Phenol, 3,5-bis(1-methylethyl)-
- Formula: C12H18O
- Molecular weight: 178.2707
- IUPAC Standard InChIKey: YYOQJBLGFMMRLJ-UHFFFAOYSA-N
- CAS Registry Number: 26886-05-5
- Chemical structure:
View 3d structure (requires JavaScript / HTML 5) - Species with the same structure:
- Other names: Phenol, 3,5-diisopropyl-; 3,5-Diisopropylphenol; 3,5-bis(1-Methylethyl)-phenol

Gas phase thermochemistry data

Data compiled by: Hussein Y. Afeefy, Joel F. Liebman, and Stephen E. Stein
Quantity | Value | Units | Method | Reference | Comment |
---|---|---|---|---|---|
ΔfH°gas | -254.1 ± 2.8 | kJ/mol | Eqk | Nesterova, Pimerzin, et al., 1989 | Isomerization |

Phase change data

Data compiled by: William E. Acree, Jr., James S. Chickos
Enthalpy of fusion
ΔfusH (kJ/mol) | Temperature (K) | Reference |
---|---|---|
12.13 | 326.3 | Bertholon and Perrin, 1975 |

Reaction thermochemistry data

Data compiled by: Hussein Y. Afeefy, Joel F. Liebman, and Stephen E. Stein
Individual Reactions
By formula: C12H18O = C12H18O
Quantity | Value | Units | Method | Reference | Comment |
---|---|---|---|---|---|
ΔrH° | -9.20 ± 0.63 | kJ/mol | Eqk | Nesterova, Pilyshchikov, et al., 1983 | liquid phase; GC |

References

Nesterova, Pimerzin, et al., 1989
Nesterova, T.N.; Pimerzin, A.A.; Rozhnov, A.M.; Karlina, T.N.,
Equilibria for the isomerization of (secondary-alkyl)phenols and cyclohexylphenols,
J. Chem. Thermodyn., 1989, 21, 385-395. [all data]
Bertholon and Perrin, 1975
Bertholon, G.; Perrin, R.,
Bull. Soc. Chim. Fr., 1975, 7/8, 1537. [all data]
Nesterova, Pilyshchikov, et al., 1983
Nesterova, T.N.; Pilyshchikov, V.A.; Rozhnov, A.M.,
Chemical Equilibrium in the system isopropylphenols-phenol,
J. Appl. Chem. USSR, 1983, 56, 1257-1261. [all data]