Phenol, 3,4,5-trimethyl-, methylcarbamate
- Formula: C11H15NO2
- Molecular weight: 193.2423
- IUPAC Standard InChIKey: AUQAUAIUNJIIEP-UHFFFAOYSA-N
- CAS Registry Number: 2686-99-9
- Chemical structure:
View 3d structure (requires JavaScript / HTML 5) - Other names: Carbamic acid, methyl-, 3,4,5-trimethylphenyl ester; Landrin; Shell 8530; SD 8530; 3,4,5-Landrin; 3,4,5-Trimethylphenyl Methylcarbamate; 3,4,5-Trimethylphenyl N-methylcarbamate; ENT-25,843; Methylcarbamic acid 3,4,5-trimethylphenyl ester; OMS-597; Shell sd-8530; 3,4,5-Trimethylfenylester kyseliny methylkarbaminove; Landrin-3,4,5

Phase change data

Data compiled by: Thermodynamics Research Center, NIST Boulder Laboratories, Chris Muzny director
Quantity | Value | Units | Method | Reference | Comment |
---|---|---|---|---|---|
Tfus | 393.8 | K | N/A | Plato, 1972 | Uncertainty assigned by TRC = 0.2 K |

References

Plato, 1972
Plato, C.,
DSC as a general method for determining purity and heat of fusion of high-purity organic chemicals,
Anal. Chem., 1972, 44, 1531. [all data]