1H-Benz[f]indene
- Formula: C13H10
- Molecular weight: 166.2185
- IUPAC Standard InChIKey: LJVOKUMRGBIJGP-UHFFFAOYSA-N
- CAS Registry Number: 268-40-6
- Chemical structure:
View 3d structure (requires JavaScript / HTML 5) - Permanent link for this species. Use this link for bookmarking this species for future reference.

Gas phase thermochemistry data

Data compiled by: Glushko Thermocenter, Russian Academy of Sciences, Moscow
Constant pressure heat capacity of gas
Cp,gas (J/mol*K) | Temperature (K) | Reference | Comment |
---|---|---|---|
39.30 | 50. | Dorofeeva O.V., 1989 | These statistically calculated values were obtained using force field approximation for polycyclic aromatic hydrocarbons to estimate the needed vibrational frequencies (see also [ Dorofeeva O.V., 1986, Moiseeva N.F., 1990]). These functions are reproduced in the reference book [ Frenkel M., 1994]. |
57.54 | 100. | ||
81.52 | 150. | ||
109.94 | 200. | ||
156.40 | 273.15 | ||
172.6 ± 1.0 | 298.15 | ||
173.80 | 300. | ||
234.87 | 400. | ||
285.99 | 500. | ||
326.95 | 600. | ||
359.78 | 700. | ||
386.46 | 800. | ||
408.46 | 900. | ||
426.81 | 1000. | ||
442.25 | 1100. | ||
455.32 | 1200. | ||
466.46 | 1300. | ||
476.01 | 1400. | ||
484.23 | 1500. |

References

Dorofeeva O.V., 1989
Dorofeeva O.V.,
Thermodynamic Properties of Gaseous Polycyclic Aromatic Hydrocarbons Containing Five-Membered Rings. Institute for High Temperatures, USSR Academy of Sciences, Preprint No.1-263 (in Russian), Moscow, 1989. [all data]
Dorofeeva O.V., 1986
Dorofeeva O.V.,
On calculation of thermodynamic properties of polycyclic aromatic hydrocarbons,
Thermochim. Acta, 1986, 102, 59-66. [all data]
Moiseeva N.F., 1990
Moiseeva N.F.,
Group additivity scheme for calculating the chemical thermodynamic properties of gaseous polycyclic aromatic hydrocarbons containing five-membered rings,
Thermochim. Acta, 1990, 168, 179-186. [all data]
Frenkel M., 1994
Frenkel M.,
Thermodynamics of Organic Compounds in the Gas State, Vol. I, II, Thermodynamics Research Center, College Station, Texas, 1994, 1994. [all data]