1-Chloro-4-decyne
- Formula: C10H17Cl
- Molecular weight: 172.695
- IUPAC Standard InChIKey: WQROTKWHQIGFTO-UHFFFAOYSA-N
- CAS Registry Number: 26817-65-2
- Chemical structure:
View 3d structure (requires JavaScript / HTML 5) - Permanent link for this species. Use this link for bookmarking this species for future reference.

Phase change data

Data compiled by: Robert L. Brown and Stephen E. Stein
Reduced pressure boiling point
Tboil (K) | Pressure (bar) | Reference |
---|---|---|
387. to 389. | 0.020 | Farchan Laboratories, 1990 |

References

Farchan Laboratories, 1990
Farchan Laboratories,
Research Chemicals Catalog, Farchan Laboratories, Gainesville, FL, 1990, 91. [all data]