2-Propenamide, N,N-dimethyl-
- Formula: C5H9NO
- Molecular weight: 99.1311
- IUPAC Standard InChIKey: YLGYACDQVQQZSW-UHFFFAOYSA-N
- CAS Registry Number: 2680-03-7
- Chemical structure:
View 3d structure (requires JavaScript / HTML 5) - Other names: Acrylamide, N,N-dimethyl-; N,N-Dimethylacrylamide; Acylamide, N,N-dimethyl; Dimethylamid kyseliny akrylove; Propenamide, N,N-dimethyl-

Phase change data

Data compiled by: Robert L. Brown and Stephen E. Stein
Reduced pressure boiling point
Tboil (K) | Pressure (bar) | Reference |
---|---|---|
353.7 | 0.027 | Aldrich Chemical Company Inc., 1990 |
354. to 356. | 0.028 | Frinton Laboratories Inc., 1986 |

Gas phase ion energetics data

Data evaluated by: Edward P. Hunter and Sharon G. Lias
Quantity | Value | Units | Method | Reference | Comment |
---|---|---|---|---|---|
Proton affinity (review) | 904.3 | kJ/mol | N/A | Hunter and Lias, 1998 | |
Quantity | Value | Units | Method | Reference | Comment |
Gas basicity | 873.4 | kJ/mol | N/A | Hunter and Lias, 1998 |

References

Aldrich Chemical Company Inc., 1990
Aldrich Chemical Company Inc.,
Catalog Handbook of Fine Chemicals, Aldrich Chemical Company, Inc., Milwaukee WI, 1990, 1. [all data]
Frinton Laboratories Inc., 1986
Frinton Laboratories Inc.,
Catalog Number 11, Frinton Laboratories Inc., Vineland, NJ, 1986, 99. [all data]
Hunter and Lias, 1998
Hunter, E.P.; Lias, S.G.,
Evaluated Gas Phase Basicities and Proton Affinities of Molecules: An Update,
J. Phys. Chem. Ref. Data, 1998, 27, 3, 413-656, https://doi.org/10.1063/1.556018
. [all data]