hexahydroacenaphthylene
- IUPAC Standard InChIKey: BDAGIAXQQBRORQ-UHFFFAOYSA-N
- CAS Registry Number: 26761-12-6
- Chemical structure:
View 3d structure (requires JavaScript / HTML 5) - Species with the same structure:

Reaction thermochemistry data

Data compiled by: Hussein Y. Afeefy, Joel F. Liebman, and Stephen E. Stein
Individual Reactions
By formula: 2H2 + C12H10 = hexahydroacenaphthylene
Quantity | Value | Units | Method | Reference | Comment |
---|---|---|---|---|---|
ΔrH° | -110. | kJ/mol | Eqk | Frye and Weitkamp, 1969 | gas phase |

References

Frye and Weitkamp, 1969
Frye, C.G.; Weitkamp, A.W.,
Equilibrium hydrogenations of multi-ring aromatics,
J. Chem. Eng. Data, 1969, 14, 372-376. [all data]