β-Alanylglycine

Phase change data

Data compiled by: Eugene S. Domalski and Elizabeth D. Hearing

Enthalpy of fusion

ΔfusH (kJ/mol) Temperature (K) Reference Comment
56.600507.95Badelin, Kulikov, et al., 1990Melting with decomposition.

References

Badelin, Kulikov, et al., 1990
Badelin, V.G.; Kulikov, O.V.; Batagin, V.S.; Udzig, E.; Zielenkiewicz, A.; Zielenkiewicz, W.; Krestov, G.A., Physico-chemical properties of peptides and their solutions, Thermochim. Acta, 1990, 169, 81-93. [all data]