1,3,5-Benzenetricarboxylic acid, trimethyl ester
- Formula: C12H12O6
- Molecular weight: 252.2201
- IUPAC Standard InChIKey: RGCHNYAILFZUPL-UHFFFAOYSA-N
- CAS Registry Number: 2672-58-4
- Chemical structure:
View 3d structure (requires JavaScript / HTML 5) - Other names: Trimesic acid trimethyl ester; Trimethyl trimesate; Trimethyl 1,3,5-benzenetricarboxylate; Trimethyl benzene-1,3,5-tricarboxylate

Condensed phase thermochemistry data

Data compiled by: Hussein Y. Afeefy, Joel F. Liebman, and Stephen E. Stein
Quantity | Value | Units | Method | Reference | Comment |
---|---|---|---|---|---|
ΔfH°solid | -1101.1 ± 1.2 | kJ/mol | Ccb | Colomina, Laynez, et al., 1972 | |
Quantity | Value | Units | Method | Reference | Comment |
ΔcH°solid | -5336.0 ± 1.0 | kJ/mol | Ccb | Colomina, Laynez, et al., 1972 | Corresponding ΔfHºsolid = -1101.11 kJ/mol (simple calculation by NIST; no Washburn corrections) |

Phase change data

Data compiled as indicated in comments:
TRC - Thermodynamics Research Center, NIST Boulder Laboratories, Chris Muzny director
AC - William E. Acree, Jr., James S. Chickos
Quantity | Value | Units | Method | Reference | Comment |
---|---|---|---|---|---|
Tfus | 419.4 | K | N/A | Dozen, Fujishima, et al., 1978 | Uncertainty assigned by TRC = 0.1 K; TRC |
Quantity | Value | Units | Method | Reference | Comment |
ΔsubH° | 118.9 ± 0.4 | kJ/mol | N/A | Jimenez, Menendez, et al., 1995 | AC |
ΔsubH° | 117.5 ± 0.8 | kJ/mol | N/A | Turrión, 1967 | See also Jimenez, Menendez, et al., 1995.; AC |
Enthalpy of vaporization
ΔvapH (kJ/mol) | Temperature (K) | Method | Reference | Comment |
---|---|---|---|---|
75.4 | 458. | A | Stephenson and Malanowski, 1987 | Based on data from 443. to 513. K.; AC |
Enthalpy of sublimation
ΔsubH (kJ/mol) | Temperature (K) | Method | Reference | Comment |
---|---|---|---|---|
115.9 ± 0.4 | 359. | ME | Jimenez, Menendez, et al., 1995 | Based on data from 350. to 368. K.; AC |
Enthalpy of fusion
ΔfusH (kJ/mol) | Temperature (K) | Method | Reference | Comment |
---|---|---|---|---|
17.6 | 419.4 | DSC | Dozen, Fujishima, et al., 1978, 2 | Fusion enthalpy may not be reliable—authors reported a mass loss as the sample melted; AC |

Kovats' RI, non-polar column, isothermal

Column type | Active phase | Temperature (C) | I | Reference | Comment |
---|---|---|---|---|---|
Packed | OV-1 | 200. | 1872. | Fedoreev and Maksimov, 1977 | Gaschrom; Column length: 1.5 m |
Packed | SE-30 | 200. | 1879. | Safar, Kafka, et al., 1972 | N2, Chromosorb G (60-80 mesh); Column length: 3.6 m |

Van Den Dool and Kratz RI, non-polar column, custom temperature program

Column type | Active phase | I | Reference | Comment |
---|---|---|---|---|
Packed | SE-30 | 1860. | Peng, Ding, et al., 1988 | Supelcoport; Chromosorb; Column length: 3.05 m; Program: 40C(5min) => 10C/min => 200C or 250C (60min) |

Normal alkane RI, non-polar column, temperature ramp

Column type | Active phase | I | Reference | Comment |
---|---|---|---|---|
Capillary | SPB-5 | 1892. | Pino, Marbot, et al., 2005 | 30. m/0.25 mm/0.25 μm, He, 60. C @ 2. min, 4. K/min, 250. C @ 20. min |

References

Colomina, Laynez, et al., 1972
Colomina, M.; Laynez, J.L.; Perez-Ossorio, R.; Turrion, C.,
Enthalpies of combustion and formation of six methyl esters of benzene carboxylic acids,
J. Chem. Thermodyn., 1972, 4, 499-506. [all data]
Dozen, Fujishima, et al., 1978
Dozen, Y.; Fujishima, S.; Shingu, H.,
Structures and fusion parameters of methoxycarbonyl-benzenes and -naphthalenes,
Thermochim. Acta, 1978, 25, 2, 209, https://doi.org/10.1016/0040-6031(78)85008-4
. [all data]
Jimenez, Menendez, et al., 1995
Jimenez, P.; Menendez, V.; Roux, M.V.; Turrion, C.,
Vapour pressures and enthalpies of sublimation of four polymethoxycarbonylbenzenes,
J. Chem. Thermodyn., 1995, 27, 679-683. [all data]
Turrión, 1967
Turrión, C.,
, Presiones de vapor y calores de sublimación de los ácidos bencenecarboxilicos y sus ésteres metilicos. Beca "Juan March" de estudios en España, grupo B, Madrid, 1967. [all data]
Stephenson and Malanowski, 1987
Stephenson, Richard M.; Malanowski, Stanislaw,
Handbook of the Thermodynamics of Organic Compounds, 1987, https://doi.org/10.1007/978-94-009-3173-2
. [all data]
Dozen, Fujishima, et al., 1978, 2
Dozen, Yasuhiko; Fujishima, Shizu; Shingu, Haruo,
Structures and fusion parameters of methoxycarbonyl-benzenes and -naphthalenes,
Thermochimica Acta, 1978, 25, 2, 209-216, https://doi.org/10.1016/0040-6031(78)85008-4
. [all data]
Fedoreev and Maksimov, 1977
Fedoreev, S.A.; Maksimov, O.B.,
The study of the composition of aromatic esters by gas-liquid chromatography,
Solid Fuel Chem. (Engl. Transl.), 1977, 17-22. [all data]
Safar, Kafka, et al., 1972
Safar, M.; Kafka, Z.; Galik, V.; Landa, S.,
Gas Chromatographic Analysis of 1,3,5-Benzenetricarboxylic and 1,3,5-Cyclohexanetricarboxylic Acid and Their Derivatives,
Collect. Czech. Chem. Commun., 1972, 39, 11, 3390-3393, https://doi.org/10.1135/cccc19743390
. [all data]
Peng, Ding, et al., 1988
Peng, C.T.; Ding, S.F.; Hua, R.L.; Yang, Z.C.,
Prediction of Retention Indexes I. Structure-Retention Index Relationship on Apolar Columns,
J. Chromatogr., 1988, 436, 137-172, https://doi.org/10.1016/S0021-9673(00)94575-8
. [all data]
Pino, Marbot, et al., 2005
Pino, J.A.; Marbot, R.; Rosado, A.; Vázquez, C.,
Volatile constituents of genipap (Genipa americana L.) fruit from Cuba,
Flavour Fragr. J., 2005, 20, 6, 583-586, https://doi.org/10.1002/ffj.1491
. [all data]