1,2,3-Benzenetricarboxylic acid, trimethyl ester
- Formula: C12H12O6
- Molecular weight: 252.2201
- IUPAC Standard InChIKey: SBOCVSUCRFVXFE-UHFFFAOYSA-N
- CAS Registry Number: 2672-57-3
- Chemical structure:

Phase change data

Data compiled as indicated in comments:
TRC - Thermodynamics Research Center, NIST Boulder Laboratories, Chris Muzny director
AC - William E. Acree, Jr., James S. Chickos
Quantity | Value | Units | Method | Reference | Comment |
---|---|---|---|---|---|
Tfus | 375.2 | K | N/A | Dozen, Fujishima, et al., 1978 | Uncertainty assigned by TRC = 0.2 K; TRC |
Enthalpy of vaporization
ΔvapH (kJ/mol) | Temperature (K) | Method | Reference | Comment |
---|---|---|---|---|
72.5 | 468. | A,GS | Stephenson and Malanowski, 1987 | Based on data from 453. to 513. K. See also Kraus, Beranek, et al., 1962.; AC |
Enthalpy of fusion
ΔfusH (kJ/mol) | Temperature (K) | Method | Reference | Comment |
---|---|---|---|---|
32.7 | 375.7 | DSC | Acree, 1993 | See also Dozen, Fujishima, et al., 1978, 2.; AC |

Kovats' RI, non-polar column, isothermal

Column type | Active phase | Temperature (C) | I | Reference | Comment |
---|---|---|---|---|---|
Packed | OV-1 | 200. | 1782. | Fedoreev and Maksimov, 1977 | Gaschrom; Column length: 1.5 m |

Van Den Dool and Kratz RI, non-polar column, custom temperature program

Column type | Active phase | I | Reference | Comment |
---|---|---|---|---|
Capillary | VF-5MS | 1827.7 | Tret'yakov, 2007 | 30. m/0.25 mm/0.25 μm, He; Program: Multi-step temperature program; T(initial)=60C; T(final)=270C |

References

Dozen, Fujishima, et al., 1978
Dozen, Y.; Fujishima, S.; Shingu, H.,
Structures and fusion parameters of methoxycarbonyl-benzenes and -naphthalenes,
Thermochim. Acta, 1978, 25, 2, 209, https://doi.org/10.1016/0040-6031(78)85008-4
. [all data]
Stephenson and Malanowski, 1987
Stephenson, Richard M.; Malanowski, Stanislaw,
Handbook of the Thermodynamics of Organic Compounds, 1987, https://doi.org/10.1007/978-94-009-3173-2
. [all data]
Kraus, Beranek, et al., 1962
Kraus, M.; Beranek, L.; Kochloeff, K.; Bazant, V.,
Chem. Prum., 1962, 12, 649. [all data]
Acree, 1993
Acree, William E.,
Thermodynamic properties of organic compounds,
Thermochimica Acta, 1993, 219, 97-104, https://doi.org/10.1016/0040-6031(93)80486-T
. [all data]
Dozen, Fujishima, et al., 1978, 2
Dozen, Yasuhiko; Fujishima, Shizu; Shingu, Haruo,
Structures and fusion parameters of methoxycarbonyl-benzenes and -naphthalenes,
Thermochimica Acta, 1978, 25, 2, 209-216, https://doi.org/10.1016/0040-6031(78)85008-4
. [all data]
Fedoreev and Maksimov, 1977
Fedoreev, S.A.; Maksimov, O.B.,
The study of the composition of aromatic esters by gas-liquid chromatography,
Solid Fuel Chem. (Engl. Transl.), 1977, 17-22. [all data]
Tret'yakov, 2007
Tret'yakov, K.V.,
Retention Data. NIST Mass Spectrometry Data Center., NIST Mass Spectrometry Data Center, 2007. [all data]