Vinyl radical
- Formula: C2H3
- Molecular weight: 27.0452
- IUPAC Standard InChIKey: ORGHESHFQPYLAO-UHFFFAOYSA-N
- CAS Registry Number: 2669-89-8
- Chemical structure:
View 3d structure (requires JavaScript / HTML 5) - Permanent link for this species. Use this link for bookmarking this species for future reference.

Gas phase thermochemistry data

Quantity | Value | Units | Method | Reference | Comment |
---|---|---|---|---|---|
ΔfH°gas | 299. ± 5. | kJ/mol | N/A | Tsang, 1996 |

Reaction thermochemistry data

Data compiled by: Robert C. Dunbar
Individual Reactions
By formula: Cr+ + C2H3 = (Cr+ • C2H3)
Quantity | Value | Units | Method | Reference | Comment |
---|---|---|---|---|---|
ΔrH° | 247. ± 9.6 | kJ/mol | CIDT | Fisher and Armentrout, 1992 |

Gas phase ion energetics data

Data evaluated as indicated in comments:
HL - Edward P. Hunter and Sharon G. Lias
Data compiled as indicated in comments:
LL - Sharon G. Lias and Joel F. Liebman
LLK - Sharon G. Lias, Rhoda D. Levin, and Sherif A. Kafafi
B - John E. Bartmess
Quantity | Value | Units | Method | Reference | Comment |
---|---|---|---|---|---|
Proton affinity (review) | 180.5 | kcal/mol | N/A | Hunter and Lias, 1998 | HL |
Quantity | Value | Units | Method | Reference | Comment |
Gas basicity | 172.0 | kcal/mol | N/A | Hunter and Lias, 1998 | HL |
Quantity | Value | Units | Method | Reference | Comment |
ΔfH°(+) ion | 262. ± 3. | kcal/mol | N/A | N/A | |
Quantity | Value | Units | Method | Reference | Comment |
ΔfH(+) ion,0K | 263. ± 3. | kcal/mol | N/A | N/A |
Electron affinity determinations
EA (eV) | Method | Reference | Comment |
---|---|---|---|
0.667 ± 0.024 | LPES | Ervin, Gronert, et al., 1990 | B |
>0.39999 | IMRB | Lindinger, Albritton, et al., 1975 | B |
Ionization energy determinations
IE (eV) | Method | Reference | Comment |
---|---|---|---|
8.25 | PE | Blush and Chen, 1992 | LL |
≤8.59 ± 0.03 | PI | Berkowitz, Mayhew, et al., 1988 | LL |
8.7 ± 0.1 | DER | Reinke, Kraessig, et al., 1973 | LLK |
8.95 | EI | Lossing, 1971 | LLK |

Ion clustering data

Data compiled by: Robert C. Dunbar
Clustering reactions
By formula: Cr+ + C2H3 = (Cr+ • C2H3)
Quantity | Value | Units | Method | Reference | Comment |
---|---|---|---|---|---|
ΔrH° | 59.0 ± 2.3 | kcal/mol | CIDT | Fisher and Armentrout, 1992 |

References

Tsang, 1996
Tsang, W.,
Heats of Formation of Organic Free Radicals by Kinetic Methods
in Energetics of Organic Free Radicals, Martinho Simoes, J.A.; Greenberg, A.; Liebman, J.F., eds., Blackie Academic and Professional, London, 1996, 22-58. [all data]
Fisher and Armentrout, 1992
Fisher, E.R.; Armentrout, P.B.,
Activation of Alkanes by Cr+: Unique Reactivity of Ground-State Cr+(6S) and Thermochemistry of Neutral and Ionic Chromium-Carbon Bonds,
J. Am. Chem. Soc., 1992, 114, 6, 2039, https://doi.org/10.1021/ja00032a017
. [all data]