Isoflurane
- Formula: C3H2ClF5O
- Molecular weight: 184.492
- IUPAC Standard InChIKey: PIWKPBJCKXDKJR-UHFFFAOYSA-N
- CAS Registry Number: 26675-46-7
- Chemical structure:
View 3d structure (requires JavaScript / HTML 5) - Other names: Ethane, 2-chloro-2-(difluoromethoxy)-1,1,1-trifluoro-; Ether, 1-chloro-2,2,2-trifluoroethyl difluoromethyl; Forane; 1-Chloro-2,2,2-trifluoroethyl difluoromethyl ether; Aerrane; 2-Chloro-2-(difluoromethoxy)-1,1,1-trifluoroethane; Compd 469; Compound 469; Forene; Ethane, 1-chloro-1-(difluoromethoxy)-2,2,2-trifluoro-; IsoFlo; R-E 235dal

Normal alkane RI, non-polar column, custom temperature program

Column type | Active phase | I | Reference | Comment |
---|---|---|---|---|
Capillary | SPB-1 | 454. | Flanagan, Streete, et al., 1997 | 60. m/0.53 mm/5. μm, He; Program: 40C(6min) => 5C/min => 80C => 10C/min => 200C |
Capillary | SPB-1 | 454. | Strete, Ruprah, et al., 1992 | 60. m/0.53 mm/5.0 μm, Helium; Program: 40 0C (6 min) 5 0C/min -> 80 0C 10 0C/min -> 200 0C |

References

Flanagan, Streete, et al., 1997
Flanagan, R.J.; Streete, P.J.; Ramsey, J.D.,
Volatile Substance Abuse, UNODC Technical Series, No 5, United Nations, Office on Drugs and Crime, Vienna International Centre, PO Box 500, A-1400 Vienna, Austria, 1997, 56, retrieved from http://www.odccp.org/pdf/technicalseries1997-01-011.pdf. [all data]
Strete, Ruprah, et al., 1992
Strete, P.J.; Ruprah, M.; Ramsey, J.D.; Flanagan, R.J.,
Detection and identification of volatile substances by headspace capillary gas chromatography to aid the diagnosis of acute poisoning,
Analyst, 1992, 117, 7, 1111-1127, https://doi.org/10.1039/an9921701111
. [all data]