α-D-Glucopyranose
- Formula: C6H12O6
- Molecular weight: 180.1559
- IUPAC Standard InChIKey: WQZGKKKJIJFFOK-MDMQIMBFSA-N
- CAS Registry Number: 26655-34-5
- Chemical structure:
View 3d structure (requires JavaScript / HTML 5) - Species with the same structure:
- Stereoisomers:
- Other names: alpha-D-Glucose; α-D-Glucose
- Comments:
- Although only a single structure is shown, this species may exist in several forms including a five membered ring and a six membered ring.

Condensed phase thermochemistry data

Data compiled by: Hussein Y. Afeefy, Joel F. Liebman, and Stephen E. Stein
Quantity | Value | Units | Method | Reference | Comment |
---|---|---|---|---|---|
ΔfH°solid | -1274.5 | kJ/mol | Ccb | Huffman and Fox, 1938 | Author's hf298_condensed=-305.73 kcal/mol |
Quantity | Value | Units | Method | Reference | Comment |
ΔcH°solid | -2799.8 ± 2.3 | kJ/mol | Ccb | Ponomarev and Alekseeva, 1961 | Corresponding ΔfHºsolid = -1276.2 kJ/mol (simple calculation by NIST; no Washburn corrections) |
ΔcH°solid | -2803.3 ± 0.42 | kJ/mol | Ccb | Skuratov, Strepikheev, et al., 1957 | Reanalyzed by Cox and Pilcher, 1970, Original value = -2805. ± 0.4 kJ/mol; Combustion at 293 K; Corresponding ΔfHºsolid = -1272.8 kJ/mol (simple calculation by NIST; no Washburn corrections) |
ΔcH°solid | -2801.5 | kJ/mol | Ccb | Huffman and Fox, 1938 | Author's hf298_condensed=-305.73 kcal/mol; Corresponding ΔfHºsolid = -1274.5 kJ/mol (simple calculation by NIST; no Washburn corrections) |

Reaction thermochemistry data

Data compiled by: Hussein Y. Afeefy, Joel F. Liebman, and Stephen E. Stein
Individual Reactions
By formula: C12H22O11 + H2O = C6H12O6 + C6H12O6
Quantity | Value | Units | Method | Reference | Comment |
---|---|---|---|---|---|
ΔrH° | 0.44 ± 0.11 | kJ/mol | Eqk | Goldberg and Tewari, 1989 | liquid phase; solvent: Aqueous; HPLC |
By formula: C12H22O11 + H2O = C6H12O6 + C6H12O6
Quantity | Value | Units | Method | Reference | Comment |
---|---|---|---|---|---|
ΔrH° | -14.93 ± 0.16 | kJ/mol | Eqk | Goldberg, Tewari, et al., 1989 | liquid phase; solvent: Aqueous |

Gas phase ion energetics data

Data evaluated by: Edward P. Hunter and Sharon G. Lias
Quantity | Value | Units | Method | Reference | Comment |
---|---|---|---|---|---|
Gas basicity | 778.9 | kJ/mol | N/A | Hunter and Lias, 1998 |

References

Huffman and Fox, 1938
Huffman, H.M.; Fox, S.W.,
Thermal data. X. The heats of combustion and free energies, at 25°, of some organic compounds concerned in carbohydrate metabolism,
J. Am. Chem. Soc., 1938, 60, 1400-1403. [all data]
Ponomarev and Alekseeva, 1961
Ponomarev, V.V.; Alekseeva, T.A.,
A massive microcalorimeter for determining heats of combustion,
Russ. J. Phys. Chem. (Engl. Transl.), 1961, 35, 800-803. [all data]
Skuratov, Strepikheev, et al., 1957
Skuratov, S.M.; Strepikheev, A.A.; Kozina, M.P.,
About the reaction activity of five and six-membered heterocyclic compounds,
Dokl. Akad. Nauk SSSR, 1957, 117, 452-454. [all data]
Cox and Pilcher, 1970
Cox, J.D.; Pilcher, G.,
Thermochemistry of Organic and Organometallic Compounds, Academic Press, New York, 1970, 1-636. [all data]
Goldberg and Tewari, 1989
Goldberg, R.N.; Tewari, Y.B.,
A calorimetric and equilibrium investigatino of the hydrolysis of lactose,
J. Biol. Chem., 1989, 264, 9897-9900. [all data]
Goldberg, Tewari, et al., 1989
Goldberg, R.N.; Tewari, Y.B.; Ahluwalia, J.C.,
Thermodynamics of the hydrolysis of sucrose,
J. Biol. Chem., 1989, 264, 9901-99. [all data]
Hunter and Lias, 1998
Hunter, E.P.; Lias, S.G.,
Evaluated Gas Phase Basicities and Proton Affinities of Molecules: An Update,
J. Phys. Chem. Ref. Data, 1998, 27, 3, 413-656, https://doi.org/10.1063/1.556018
. [all data]