Nonyl acrylate
- Formula: C12H22O2
- Molecular weight: 198.3019
- IUPAC Standard InChIKey: MDYPDLBFDATSCF-UHFFFAOYSA-N
- CAS Registry Number: 2664-55-3
- Chemical structure:
View 3d structure (requires JavaScript / HTML 5) - Permanent link for this species. Use this link for bookmarking this species for future reference.

Condensed phase thermochemistry data

Data compiled by: Eugene S. Domalski and Elizabeth D. Hearing
Constant pressure heat capacity of liquid
Cp,liquid (J/mol*K) | Temperature (K) | Reference | Comment |
---|---|---|---|
417.9 | 298.15 | Karabaev, Saidov, et al., 1985 | T = 90 to 350 K. Cp(c) = 85.37 + 6.51 T J/kg*K (98 to 210 K); Cp(liq) = 398.84 + 5.73T J/kg*K (236.5 to 350 K). Cp data calculated from equation. |

Phase change data

Data compiled as indicated in comments:
DH - Eugene S. Domalski and Elizabeth D. Hearing
TRC - Thermodynamics Research Center, NIST Boulder Laboratories, Chris Muzny director
AC - William E. Acree, Jr., James S. Chickos
Quantity | Value | Units | Method | Reference | Comment |
---|---|---|---|---|---|
Tfus | 236.5 | K | N/A | Karabaev, Saidov, et al., 1985 | DH |
Tfus | 236.5 | K | N/A | Karabaev, Abduzhaminov, et al., 1985 | Uncertainty assigned by TRC = 0.1 K; TRC |
Enthalpy of fusion
ΔfusH (kJ/mol) | Temperature (K) | Reference | Comment |
---|---|---|---|
23.362 | 236.5 | Karabaev, Abduzhaminov, et al., 1985, 2 | DH |
23.36 | 236.5 | Domalski and Hearing, 1996 | AC |
Entropy of fusion
ΔfusS (J/mol*K) | Temperature (K) | Reference | Comment |
---|---|---|---|
98.8 | 236.5 | Karabaev, Abduzhaminov, et al., 1985, 2 | DH |

Kovats' RI, non-polar column, isothermal

Column type | Active phase | Temperature (C) | I | Reference | Comment |
---|---|---|---|---|---|
Capillary | OV-101 | 170. | 1373. | Horna, Táborský, et al., 1985 | N2; Column length: 19. m; Column diameter: 0.28 mm |
Capillary | OV-101 | 200. | 1374. | Horna, Táborský, et al., 1985 | N2; Column length: 19. m; Column diameter: 0.28 mm |

Kovats' RI, polar column, isothermal

Column type | Active phase | Temperature (C) | I | Reference | Comment |
---|---|---|---|---|---|
Capillary | SP-1000 | 170. | 1689. | Horna, Táborský, et al., 1985 | N2; Column length: 46. m; Column diameter: 0.23 mm |
Capillary | SP-1000 | 200. | 1695. | Horna, Táborský, et al., 1985 | N2; Column length: 46. m; Column diameter: 0.23 mm |

References

Karabaev, Saidov, et al., 1985
Karabaev, M.; Saidov, A.A.; Abduzhaminov, T.P.; Kenisarin, M.M.,
Heat capacity and molecular kinetic processes of condensed phase acrylates and methacrylates, Izv. Akad. Nauk UzSSR,
Ser. Fiz.-Math., 1985, (6), 51-54. [all data]
Karabaev, Abduzhaminov, et al., 1985
Karabaev, M.K.; Abduzhaminov, T.P.; Kenisarin, M.M.; Saidov, A.A.,
Thermodynamics of the crystal-liquid phase transition in acrylates and methacrylates.,
Izv. Akad. Nauk Uzb. SSR Ser., Fiz-Mat. Nauk, 1985, 1985, No. 5, 74-7. [all data]
Karabaev, Abduzhaminov, et al., 1985, 2
Karabaev, M.K.; Abduzhaminov, T.P.; Kenisarin, M.M.; Saidov, A.A.,
Thermodynamics of the crystal-liquid phase transition in acrylates and methacrylates, Izv. Akad. Nauk Uzb. SSR,
Ser. Fiz.-Mat. Nauk, 1985, (5), 74-77. [all data]
Domalski and Hearing, 1996
Domalski, Eugene S.; Hearing, Elizabeth D.,
Heat Capacities and Entropies of Organic Compounds in the Condensed Phase. Volume III,
J. Phys. Chem. Ref. Data, 1996, 25, 1, 1, https://doi.org/10.1063/1.555985
. [all data]