Benzeneacetaldehyde, α-(2-methylpropylidene)-
- Formula: C12H14O
- Molecular weight: 174.2390
- IUPAC Standard InChIKey: ULRYRAHIBWLZKC-XYOKQWHBSA-N
- CAS Registry Number: 26643-91-4
- Chemical structure:
View 3d structure (requires JavaScript / HTML 5) - Other names: 4-Methyl-2-phenyl-2-pentenal; 2-Pentenal, 4-methyl-2-phenyl; 2-Phenyl-4-methyl-2-pentenal

Van Den Dool and Kratz RI, polar column, temperature ramp

Column type | Active phase | I | Reference | Comment |
---|---|---|---|---|
Capillary | OV-351 | 1932. | Bonvehí, 2005 | 50. m/0.32 mm/0.2 μm, He, 5. K/min; Tstart: 60. C; Tend: 220. C |

Normal alkane RI, non-polar column, custom temperature program

Column type | Active phase | I | Reference | Comment |
---|---|---|---|---|
Capillary | HP-5 | 1383. | Splivallo, Bossi, et al., 2007 | He; Program: 50C => 3C/min => 200C(10min) => 10C/min => 290C(10min) |

Normal alkane RI, polar column, temperature ramp

Column type | Active phase | I | Reference | Comment |
---|---|---|---|---|
Capillary | Carbowax 20M | 1920. | Buttery, Ling, et al., 1983 | 50. C @ 30. min, 1. K/min, 170. C @ 60. min; Column length: 150. m; Column diameter: 0.64 mm |

References

Bonvehí, 2005
Bonvehí, J.S.,
Investigation of aromatic compounds in roasted cocoa powder,
Eur. Food Res. Technol., 2005, 221, 1-2, 19-29, https://doi.org/10.1007/s00217-005-1147-y
. [all data]
Splivallo, Bossi, et al., 2007
Splivallo, R.; Bossi, S.; Maffei, M.; Bonfante, P.,
Discrimination of truffle fruiting body versus mycelial aromas by stir bar sorptive extraction,
Phytochemistry, 2007, 68, 20, 2584-2598, https://doi.org/10.1016/j.phytochem.2007.03.030
. [all data]
Buttery, Ling, et al., 1983
Buttery, R.G.; Ling, L.C.; Teranishi, R.; Mon, T.R.,
Insect attractants: volatiles of hydrolizyed protein insect baits,
J. Agric. Food Chem., 1983, 31, 4, 689-692, https://doi.org/10.1021/jf00118a003
. [all data]