CH3CONHCH(CH3)COOCH3
- Formula: C6H11NO3
- Molecular weight: 145.1564
- IUPAC Standard InChIKey: FQGVVDYNRHNTCK-UHFFFAOYSA-N
- CAS Registry Number: 26629-33-4
- Chemical structure:
View 3d structure (requires JavaScript / HTML 5) - Stereoisomers:

Reaction thermochemistry data

Data compiled as indicated in comments:
M - Michael M. Meot-Ner (Mautner) and Sharon G. Lias
B - John E. Bartmess
Individual Reactions
By formula: (C2H3O2- • C6H11NO3) + H2O = (C2H3O2- • H2O • C6H11NO3)
Bond type: Hydrogen bond (negative ion to hydride)
Quantity | Value | Units | Method | Reference | Comment |
---|---|---|---|---|---|
ΔrH° | 55.2 | kJ/mol | PHPMS | Meot-Ner (Mautner), 1988 | gas phase; M |
Quantity | Value | Units | Method | Reference | Comment |
ΔrS° | 106. | J/mol*K | PHPMS | Meot-Ner (Mautner), 1988 | gas phase; M |
By formula: C6H11NO3 + CH4O = (C6H11NO3 • CH4O)
Quantity | Value | Units | Method | Reference | Comment |
---|---|---|---|---|---|
ΔrH° | 75. | kJ/mol | PHPMS | Meot-Ner (Mautner), 1988 | gas phase; M |
Quantity | Value | Units | Method | Reference | Comment |
ΔrS° | 100. | J/mol*K | PHPMS | Meot-Ner (Mautner), 1988 | gas phase; M |
Free energy of reaction
ΔrG° (kJ/mol) | T (K) | Method | Reference | Comment |
---|---|---|---|---|
28. | 392. | PHPMS | Meot-Ner (Mautner), 1988 | gas phase; M |
By formula: HS- + C6H11NO3 = (HS- • C6H11NO3)
Quantity | Value | Units | Method | Reference | Comment |
---|---|---|---|---|---|
ΔrH° | 115. ± 4.2 | kJ/mol | TDAs | Meot-ner, 1988 | gas phase; B |
Quantity | Value | Units | Method | Reference | Comment |
ΔrG° | 80.3 ± 8.4 | kJ/mol | TDAs | Meot-ner, 1988 | gas phase; B |
By formula: Cl- + C6H11NO3 = (Cl- • C6H11NO3)
Quantity | Value | Units | Method | Reference | Comment |
---|---|---|---|---|---|
ΔrH° | 123. ± 4.2 | kJ/mol | TDAs | Meot-ner, 1988 | gas phase; B |
Quantity | Value | Units | Method | Reference | Comment |
ΔrG° | 87.4 ± 4.2 | kJ/mol | TDAs | Meot-ner, 1988 | gas phase; B |
By formula: C2H3O2- + C6H11NO3 = (C2H3O2- • C6H11NO3)
Quantity | Value | Units | Method | Reference | Comment |
---|---|---|---|---|---|
ΔrH° | 131. ± 4.2 | kJ/mol | TDAs | Meot-ner, 1988 | gas phase; B |
Quantity | Value | Units | Method | Reference | Comment |
ΔrG° | 86.6 ± 4.2 | kJ/mol | TDAs | Meot-ner, 1988 | gas phase; B |
By formula: CN- + C6H11NO3 = (CN- • C6H11NO3)
Quantity | Value | Units | Method | Reference | Comment |
---|---|---|---|---|---|
ΔrH° | 110. ± 4.2 | kJ/mol | TDAs | Meot-ner, 1988 | gas phase; B |
Quantity | Value | Units | Method | Reference | Comment |
ΔrG° | 74.5 ± 4.2 | kJ/mol | TDAs | Meot-ner, 1988 | gas phase; B |
By formula: (C6H11NO3 • H2O) + H2O = (C6H11NO3 • 2H2O)
Quantity | Value | Units | Method | Reference | Comment |
---|---|---|---|---|---|
ΔrH° | 54.4 | kJ/mol | PHPMS | Meot-Ner (Mautner), 1988 | gas phase; M |
Quantity | Value | Units | Method | Reference | Comment |
ΔrS° | 82.8 | J/mol*K | PHPMS | Meot-Ner (Mautner), 1988 | gas phase; M |
By formula: C6H11NO3 + C6H11NO3 = (C6H11NO3 • C6H11NO3)
Quantity | Value | Units | Method | Reference | Comment |
---|---|---|---|---|---|
ΔrH° | 118. | kJ/mol | PHPMS | Meot-Ner (Mautner), 1988 | gas phase; M |
Quantity | Value | Units | Method | Reference | Comment |
ΔrS° | 169. | J/mol*K | PHPMS | Meot-Ner (Mautner), 1988 | gas phase; M |
By formula: C6H11NO3 + H2O = (C6H11NO3 • H2O)
Quantity | Value | Units | Method | Reference | Comment |
---|---|---|---|---|---|
ΔrH° | 63.6 | kJ/mol | PHPMS | Meot-Ner (Mautner), 1988 | gas phase; M |
Quantity | Value | Units | Method | Reference | Comment |
ΔrS° | 87.4 | J/mol*K | PHPMS | Meot-Ner (Mautner), 1988 | gas phase; M |
By formula: C6H11NO3 + C4H5N = (C6H11NO3 • C4H5N)
Quantity | Value | Units | Method | Reference | Comment |
---|---|---|---|---|---|
ΔrH° | 100. | kJ/mol | PHPMS | Meot-Ner (Mautner), 1988 | gas phase; M |
Quantity | Value | Units | Method | Reference | Comment |
ΔrS° | 134. | J/mol*K | PHPMS | Meot-Ner (Mautner), 1988 | gas phase; M |

Gas phase ion energetics data

Data evaluated by: Edward P. Hunter and Sharon G. Lias
Quantity | Value | Units | Method | Reference | Comment |
---|---|---|---|---|---|
Proton affinity (review) | 938.6 | kJ/mol | N/A | Hunter and Lias, 1998 | |
Quantity | Value | Units | Method | Reference | Comment |
Gas basicity | 888.0 | kJ/mol | N/A | Hunter and Lias, 1998 |

Ion clustering data

Data compiled by: John E. Bartmess
Clustering reactions
By formula: CN- + C6H11NO3 = (CN- • C6H11NO3)
Quantity | Value | Units | Method | Reference | Comment |
---|---|---|---|---|---|
ΔrH° | 110. ± 4.2 | kJ/mol | TDAs | Meot-ner, 1988 | gas phase |
Quantity | Value | Units | Method | Reference | Comment |
ΔrG° | 74.5 ± 4.2 | kJ/mol | TDAs | Meot-ner, 1988 | gas phase |
By formula: C2H3O2- + C6H11NO3 = (C2H3O2- • C6H11NO3)
Quantity | Value | Units | Method | Reference | Comment |
---|---|---|---|---|---|
ΔrH° | 131. ± 4.2 | kJ/mol | TDAs | Meot-ner, 1988 | gas phase |
Quantity | Value | Units | Method | Reference | Comment |
ΔrG° | 86.6 ± 4.2 | kJ/mol | TDAs | Meot-ner, 1988 | gas phase |
By formula: Cl- + C6H11NO3 = (Cl- • C6H11NO3)
Quantity | Value | Units | Method | Reference | Comment |
---|---|---|---|---|---|
ΔrH° | 123. ± 4.2 | kJ/mol | TDAs | Meot-ner, 1988 | gas phase |
Quantity | Value | Units | Method | Reference | Comment |
ΔrG° | 87.4 ± 4.2 | kJ/mol | TDAs | Meot-ner, 1988 | gas phase |
By formula: HS- + C6H11NO3 = (HS- • C6H11NO3)
Quantity | Value | Units | Method | Reference | Comment |
---|---|---|---|---|---|
ΔrH° | 115. ± 4.2 | kJ/mol | TDAs | Meot-ner, 1988 | gas phase |
Quantity | Value | Units | Method | Reference | Comment |
ΔrG° | 80.3 ± 8.4 | kJ/mol | TDAs | Meot-ner, 1988 | gas phase |

References

Meot-Ner (Mautner), 1988
Meot-Ner (Mautner), M.,
Models for Strong Interactions in Proteins and Enzymes. 2. Interactions of Ions with the Peptide Link and Imidazole,
J. Am. Chem. Soc., 1988, 110, 10, 3075, https://doi.org/10.1021/ja00218a014
. [all data]
Meot-ner, 1988
Meot-ner, M.,
Ionic Hydrogen Bond and Ion Solvation. 6. Interaction Energies of the Acetate Ion with Organic Molecules. Comparison of CH3COO- with Cl-, CN-, and SH-,
J. Am. Chem. Soc., 1988, 110, 12, 3854, https://doi.org/10.1021/ja00220a022
. [all data]
Hunter and Lias, 1998
Hunter, E.P.; Lias, S.G.,
Evaluated Gas Phase Basicities and Proton Affinities of Molecules: An Update,
J. Phys. Chem. Ref. Data, 1998, 27, 3, 413-656, https://doi.org/10.1063/1.556018
. [all data]