Gallium anion
- Formula: Ga-
- Molecular weight: 69.724
- IUPAC Standard InChIKey: IQDPVEGVKWLFKQ-UHFFFAOYSA-N
- CAS Registry Number: 26575-18-8
- Chemical structure:
View 3d structure (requires JavaScript / HTML 5) - Information on this page:

Gas phase thermochemistry data

Data compiled as indicated in comments:
B - John E. Bartmess
Quantity | Value | Units | Method | Reference | Comment |
---|---|---|---|---|---|
ΔfH°gas | 231. ± 15. | kJ/mol | Acid | Williams, Carpenter, et al., 1998 | B |
Quantity | Value | Units | Method | Reference | Comment |
S°gas,1 bar | 175.80 | J/mol*K | Review | Chase, 1998 | Data last reviewed in June, 1983 |

Reaction thermochemistry data

Data compiled by: John E. Bartmess
Individual Reactions
+
= HGa
Quantity | Value | Units | Method | Reference | Comment |
---|---|---|---|---|---|
ΔrH° | 1546. ± 14. | kJ/mol | D-EA | Williams, Carpenter, et al., 1998 | gas phase |
Quantity | Value | Units | Method | Reference | Comment |
ΔrG° | 1523. ± 15. | kJ/mol | H-TS | Williams, Carpenter, et al., 1998 | gas phase |

Gas phase ion energetics data

Data compiled by: John E. Bartmess
Protonation reactions
+
= HGa
Quantity | Value | Units | Method | Reference | Comment |
---|---|---|---|---|---|
ΔrH° | 1546. ± 14. | kJ/mol | D-EA | Williams, Carpenter, et al., 1998 | gas phase |
Quantity | Value | Units | Method | Reference | Comment |
ΔrG° | 1523. ± 15. | kJ/mol | H-TS | Williams, Carpenter, et al., 1998 | gas phase |

References

Williams, Carpenter, et al., 1998
Williams, W.W.; Carpenter, D.L.; Covington, A.M.; Koepnick, M.C.; Calabrese, D.; Thompson, J.S.,
Laser photodetachment electron spectrometry of Ga-,
J. Phys. B: Atom. Mol. Opt. Phys., 1998, 31, 8, L341-L345, https://doi.org/10.1088/0953-4075/31/8/003
. [all data]
Chase, 1998
Chase, M.W., Jr.,
NIST-JANAF Themochemical Tables, Fourth Edition,
J. Phys. Chem. Ref. Data, Monograph 9, 1998, 1-1951. [all data]