Polyacetylene

Condensed phase thermochemistry data

Data compiled by: Eugene S. Domalski and Elizabeth D. Hearing

Constant pressure heat capacity of solid

Cp,solid (J/mol*K) Temperature (K) Reference Comment
60.300.Leising and Kahlert, 1983T = 60 to 300 K. Cis isomer. Cp = 40 J/mol*K for trans isomer. Data given graphically. Data estimated from graph.

References

Leising and Kahlert, 1983
Leising, G.; Kahlert, H., Thermal properties of doped and undoped polyacetylene ((CH)x), J. Phys. (Paris), Colloq., 1983, (C3), 111-114. [all data]