Hexanedioic acid, polymer with 1,4-butanediol and 1,2-ethanediol

Condensed phase thermochemistry data

Data compiled by: Eugene S. Domalski and Elizabeth D. Hearing

Quantity Value Units Method Reference Comment
liquid471.1J/mol*KN/ABabinkov, Rabinovich, et al., 1982S° = 1.796 kJ/kg*K at 298.15 K.
liquid527.0J/mol*KN/ABabinkov, Rabinovich, et al., 1982S° = 2.009 kJ/kg*K at 298.15 K.

Constant pressure heat capacity of liquid

Cp,liquid (J/mol*K) Temperature (K) Reference Comment
482.4298.15Babinkov, Rabinovich, et al., 1982T = 5 to 330 K. Cp = 1.839 kJ/kg*K at 298.15 K.
482.4298.15Babinkov, Rabinovich, et al., 1982T = 5 to 330 K. Cp = 1.839 kJ/kg*K at 298.15 K.

References

Babinkov, Rabinovich, et al., 1982
Babinkov, A.G.; Rabinovich, I.B.; Mikhaleva, L.A., Heat capacity of oligoethylene butylene glycol adipate in the 6 to 300 K range, 1982, Termodin. [all data]