Galactose
- Formula: C6H12O6
- Molecular weight: 180.1559
- CAS Registry Number: 26566-61-0

Reaction thermochemistry data

Data compiled by: Robert C. Dunbar
Individual Reactions
By formula: Na+ + C6H12O6 = (Na+ • C6H12O6)
Quantity | Value | Units | Method | Reference | Comment |
---|---|---|---|---|---|
ΔrH° | 42.3 | kcal/mol | CIDC | Cerda and Wesdemiotis, 1999 |
Free energy of reaction
ΔrG° (kcal/mol) | T (K) | Method | Reference |
---|---|---|---|
0.0 | 298. | CIDC | Cerda and Wesdemiotis, 1999 |

Ion clustering data

Data compiled by: Robert C. Dunbar

Clustering reactions

Sodium ion (1+) + C6H12O6 = (Sodium ion (1+) • C6H12O6)

By formula: Na+ + C6H12O6 = (Na+ • C6H12O6)

Quantity Value Units Method Reference Comment
Δr177.kJ/molCIDCCerda and Wesdemiotis, 1999

Free energy of reaction

ΔrG° (kJ/mol) T (K) Method Reference
0.0298.CIDCCerda and Wesdemiotis, 1999

References

Cerda and Wesdemiotis, 1999
Cerda, B.A.; Wesdemiotis, C.,
Thermochemistry and Structures of Na+ Coordinated Mono- and Disaccharide Stereoisomers,
Int. J. Mass Spectrom., 1999, 189, 2-3, 189, https://doi.org/10.1016/S1387-3806(99)00085-8
. [all data]