Benzene, 1,4-didecyl-
- Formula: C26H46
- Molecular weight: 358.6434
- IUPAC Standard InChIKey: LVYZEGXWMAKHQM-UHFFFAOYSA-N
- CAS Registry Number: 2655-95-0
- Chemical structure:

Phase change data

Data compiled as indicated in comments:
TRC - Thermodynamics Research Center, NIST Boulder Laboratories, Chris Muzny director
AC - William E. Acree, Jr., James S. Chickos
Quantity | Value | Units | Method | Reference | Comment |
---|---|---|---|---|---|
Tfus | 302.15 | K | N/A | Anonymous, 1968 | Uncertainty assigned by TRC = 0.5 K; TRC |
Tfus | 303. | K | N/A | Studt, 1965 | Uncertainty assigned by TRC = 1. K; TRC |
Enthalpy of vaporization
ΔvapH (kJ/mol) | Temperature (K) | Method | Reference | Comment |
---|---|---|---|---|
95.2 | 483. | A | Stephenson and Malanowski, 1987 | Based on data from 468. to 536. K.; AC |

References

Anonymous, 1968
Anonymous, R.,
Properties of hydrocarbon of high molecular weight, Am. Pet. Inst. Res. Proj. 42, Penn. State Univ., 1968. [all data]
Studt, 1965
Studt, P.,
C26-hydrocarbons as model lubricants,
Justus Liebigs Ann. Chem., 1965, 685, 49-55. [all data]
Stephenson and Malanowski, 1987
Stephenson, Richard M.; Malanowski, Stanislaw,
Handbook of the Thermodynamics of Organic Compounds, 1987, https://doi.org/10.1007/978-94-009-3173-2
. [all data]