2-Hexanol, (R)-
- Formula: C6H14O
- Molecular weight: 102.1748
- IUPAC Standard InChIKey: QNVRIHYSUZMSGM-LURJTMIESA-N
- CAS Registry Number: 26549-24-6
- Chemical structure:
View 3d structure (requires JavaScript / HTML 5) - Stereoisomers:
- Other names: (R)-(-)-2-Hexanol

Phase change data

Data compiled as indicated in comments:
BS - Robert L. Brown and Stephen E. Stein
TRC - Thermodynamics Research Center, NIST Boulder Laboratories, Chris Muzny director
Quantity | Value | Units | Method | Reference | Comment |
---|---|---|---|---|---|
Tboil | 410.7 | K | N/A | Aldrich Chemical Company Inc., 1990 | BS |
Tboil | 410.15 | K | N/A | Levene and Haller, 1929 | Uncertainty assigned by TRC = 2. K; TRC |
Tboil | 410.65 | K | N/A | Levene and Haller, 1928 | Uncertainty assigned by TRC = 4. K; TRC |

References

Aldrich Chemical Company Inc., 1990
Aldrich Chemical Company Inc.,
Catalog Handbook of Fine Chemicals, Aldrich Chemical Company, Inc., Milwaukee WI, 1990, 1. [all data]
Levene and Haller, 1929
Levene, P.A.; Haller, H.L.,
The Correlation of the Configuration of 2-, 3- and 4-Substituted Chloro and Hydroxy Aliphatic Acids,
J. Biol. Chem., 1929, 83, 591. [all data]
Levene and Haller, 1928
Levene, P.A.; Haller, H.L.,
J. Biol. Chem., 1928, 79, 475. [all data]