Zeranol
- Formula: C18H26O5
- Molecular weight: 322.3960
- IUPAC Standard InChIKey: DWTTZBARDOXEAM-UHFFFAOYSA-N
- CAS Registry Number: 26538-44-3
- Chemical structure:

Normal alkane RI, non-polar column, custom temperature program

Column type | Active phase | I | Reference | Comment |
---|---|---|---|---|
Capillary | DB-1 | 2842. | Bowers, 1996 | 30. m/0.25 mm/0.25 μm, Helium; Program: 170 0C 20 0C/min -> 260 0C 2.7 0C/min -> 305 0C 20 0C/min -> 320 0C |

References

Bowers, 1996
Bowers, L.D.,
Separation and confirmation of anabolic steroids with quadrupole ion trap tandem mass spectrometry,
J. Chromatogr. B, 1996, 687, 1, 69-78, https://doi.org/10.1016/S0378-4347(96)00231-9
. [all data]