9,12,15-Octadecatrienal

Normal alkane RI, non-polar column, temperature ramp

Data compiled by: NIST Mass Spectrometry Data Center, William E. Wallace, director

Column type Capillary
Active phase HP-101
Column length (m) 25.
Carrier gas He
Substrate
Column diameter (mm) 0.2
Phase thickness (μm) 0.2
Tstart (C) 70.
Tend (C) 200.
Heat rate (K/min) 3.
Initial hold (min) 2.
Final hold (min)
I 2109.
ReferenceJerkovic, Mastelic, et al., 2007
Comment MSDC-RI

References

Jerkovic, Mastelic, et al., 2007
Jerkovic, I.; Mastelic, J.; Marijanovic, Z., Bound volatile compounds and essential oil from the fruit of Maclura pomifera (Raf.) Schneid. (osage orange), Flavour Fragr. J., 2007, 22, 1, 84-88, https://doi.org/10.1002/ffj.1763 . [all data]