3-Octanol, 2-methyl-
- Formula: C9H20O
- Molecular weight: 144.2545
- IUPAC Standard InChIKey: DIVBBSLQUDHECU-UHFFFAOYSA-N
- CAS Registry Number: 26533-34-6
- Chemical structure:
View 3d structure (requires JavaScript / HTML 5) - Other names: 2-Methyl-3-octanol; 2-methyloctan-3-ol

Phase change data

Data compiled as indicated in comments:
TRC - Thermodynamics Research Center, NIST Boulder Laboratories, Chris Muzny director
AC - William E. Acree, Jr., James S. Chickos
Quantity | Value | Units | Method | Reference | Comment |
---|---|---|---|---|---|
Tboil | 457.15 | K | N/A | Pickard and Kenyon, 1912 | Uncertainty assigned by TRC = 3. K; TRC |
Enthalpy of vaporization
ΔvapH (kJ/mol) | Temperature (K) | Reference | Comment |
---|---|---|---|
49.5 | 403. | Wilhoit and Zwolinski, 1973 | Based on data from 388. to 453. K.; AC |

Normal alkane RI, non-polar column, temperature ramp

View large format table.

Column type Active phase I Reference Comment
CapillaryDB-51092.Dhanda, Pegg, et al., 200360. m/0.25 mm/0.25 μm, He, 35. C @ 2. min, 5. K/min, 280. C @ 4. min

References

Pickard and Kenyon, 1912
Pickard, R.H.; Kenyon, J.,
Investigations on the dependence of rotatory power on chemical constitution: II the rotations of some secondary alcohols containing the isopropyl group,
J. Chem. Soc., 1912, 101, 620-38. [all data]
Wilhoit and Zwolinski, 1973
Wilhoit, R.C.; Zwolinski, B.J.,
Physical and thermodynamic properties of aliphatic alcohols,
J. Phys. Chem. Ref. Data Suppl., 1973, 1, 2, 1. [all data]