Ethanol, 2-(3,3-dimethylcyclohexylidene)-, (Z)-
- Formula: C10H18O
- Molecular weight: 154.2493
- IUPAC Standard InChIKey: SHYLMMBHTKLAJS-UITAMQMPSA-N
- CAS Registry Number: 26532-23-0
- Chemical structure:
View 3d structure (requires JavaScript / HTML 5) - Other names: (Z)-2-(3,3-Dimethylcyclohexylidene)ethanol; (2Z)-2-(3,3-Dimethylcyclohexylidene)ethanol; cis-3,3-dimethyl-δ1-β-cyclohexanethanol; Grandlure II; Ethanol, 2-(3,3-dimethylcyclohexylidene)-, (2Z)-

Kovats' RI, polar column, isothermal

Column type | Active phase | Temperature (C) | I | Reference | Comment |
---|---|---|---|---|---|
Capillary | Carbowax 20M | 130. | 1865. | Hedin, Thopson, et al., 1972 | N2; Column length: 15.24 m; Column diameter: 0.5 mm |

Normal alkane RI, non-polar column, custom temperature program

Column type | Active phase | I | Reference | Comment |
---|---|---|---|---|
Packed | OV-101 | 1225. | Swigar and Silverstein, 1981 | N2, Chromosorb G 60-80mesh DMCS; Column length: 2.5 m; Program: not specified |

References

Hedin, Thopson, et al., 1972
Hedin, P.A.; Thopson, A.C.; Gueldner, R.C.; Minyard, J.P.,
Volatile constituents of the boll weevil,
J. Insect. Physiol., 1972, 18, 1, 79-86, https://doi.org/10.1016/0022-1910(72)90066-2
. [all data]
Swigar and Silverstein, 1981
Swigar, A.A.; Silverstein, R.M.,
Monoterpenes, Aldrich Chemical Company, Milwaukee, WI, USA, 1981, 130. [all data]