trichlorotrifluoroethane
- Formula: C2Cl3F3
- Molecular weight: 187.376
- IUPAC Standard InChIKey: BOSAWIQFTJIYIS-UHFFFAOYSA-N
- CAS Registry Number: 26523-64-8
- Chemical structure:
View 3d structure (requires JavaScript / HTML 5) - Species with the same structure:

Phase change data

Data compiled by: William E. Acree, Jr., James S. Chickos
Enthalpy of vaporization
ΔvapH (kJ/mol) | Temperature (K) | Reference | Comment |
---|---|---|---|
30.5 | 263. | Reidel, 1938 | Based on data from 248. to 352. K. |

References

Reidel, 1938
Reidel, L.,
Z. Ges. Kalte-Ind., 1938, 45, 221. [all data]